[Zope-Coders] Zope test results

background@shane.zope.com background@shane.zope.com
Mon, 17 Dec 2001 22:15:58 -0500 (EST)


**************************
Head
**************************
======================================================================
FAIL: checkStackSize (testRestrictions.RestrictionTests)
----------------------------------------------------------------------
Traceback (most recent call last):
  File "/home/background/zopetest/lib/python/RestrictedPython/tests/testRestrictions.py", line 276, in checkStackSize
    self.failUnless(
  File "/usr/lib/python2.1/unittest.py", line 249, in failUnless
    if not expr: raise self.failureException, msg
AssertionError: The stack size estimate for printToNone() should have been at least 4, but was only 3
----------------------------------------------------------------------
Ran 1094 tests in 162.961s

FAILED (failures=1)

======================================================================
OVERALL FAILED (total failures=1)

**************************
2.5 branch
**************************
Module testTemporaryStorage.py failed to load
exceptions.ImportError: No module named Mount
  File "utilities/testrunner.py", line 60, in getSuiteFromFile
   File "/home/background/zopetest/lib/python/Products/TemporaryFolder/tests/testTemporaryStorage.py", line 8, in ?
    from Products.TemporaryFolder import TemporaryStorage
   File "/home/background/zopetest/lib/python/Products/TemporaryFolder/__init__.py", line 20, in ?
    import TemporaryFolder
   File "/home/background/zopetest/lib/python/Products/TemporaryFolder/TemporaryFolder.py", line 20, in ?
    from ZODB.Mount import MountPoint


Module testSessionDataManager.py failed to load
exceptions.ImportError: cannot import name MountedTemporaryFolder
  File "utilities/testrunner.py", line 60, in getSuiteFromFile
   File "/home/background/zopetest/lib/python/Products/Sessions/tests/testSessionDataManager.py", line 27, in ?
    from Products.TemporaryFolder.TemporaryFolder import MountedTemporaryFolder


======================================================================
FAIL: checkStackSize (testRestrictions.RestrictionTests)
----------------------------------------------------------------------
Traceback (most recent call last):
  File "/home/background/zopetest/lib/python/RestrictedPython/tests/testRestrictions.py", line 276, in checkStackSize
    self.failUnless(
  File "/usr/lib/python2.1/unittest.py", line 249, in failUnless
    if not expr: raise self.failureException, msg
AssertionError: The stack size estimate for printToNone() should have been at least 4, but was only 3
----------------------------------------------------------------------
Ran 1044 tests in 150.272s

FAILED (failures=1)

======================================================================
OVERALL FAILED (total failures=1)

**************************
Head with Python 2.2c1+
**************************

Module testRestrictions.py failed to load
exceptions.KeyError: 314
  File "utilities/testrunner.py", line 60, in getSuiteFromFile
   File "/home/background/zopetest/lib/python/RestrictedPython/tests/testRestrictions.py", line 68, in ?
    create_rmodule()
   File "/home/background/zopetest/lib/python/RestrictedPython/tests/testRestrictions.py", line 59, in create_rmodule
    code = compile_restricted(source, fn, 'exec')
   File "/home/background/zopetest/lib/python/RestrictedPython/Compilers.py", line 141, in compile_restricted
    r = compile_restricted_exec(source, filename)
   File "/home/background/zopetest/lib/python/RestrictedPython/Compilers.py", line 84, in compile_restricted_exec
    tree, err = tryParsing(s, 'exec')
   File "/home/background/zopetest/lib/python/RestrictedPython/Compilers.py", line 38, in tryParsing
    return parser(source), None
   File "/home/background/zopetest/lib/python/RestrictedPython/compiler/transformer.py", line 109, in parsesuite
    return self.transform(parser.suite(text))
   File "/home/background/zopetest/lib/python/RestrictedPython/compiler/transformer.py", line 103, in transform
    return self.compile_node(tree)
   File "/home/background/zopetest/lib/python/RestrictedPython/compiler/transformer.py", line 132, in compile_node
    return self.file_input(node[1:])
   File "/home/background/zopetest/lib/python/RestrictedPython/compiler/transformer.py", line 163, in file_input
    self.com_append_stmt(stmts, node)
   File "/home/background/zopetest/lib/python/RestrictedPython/compiler/transformer.py", line 955, in com_append_stmt
    result = self.com_node(node)
   File "/home/background/zopetest/lib/python/RestrictedPython/compiler/transformer.py", line 704, in com_node
    return self._dispatch[node[0]](node[1:])
   File "/home/background/zopetest/lib/python/RestrictedPython/compiler/transformer.py", line 230, in stmt
    return self.com_stmt(nodelist[0])
   File "/home/background/zopetest/lib/python/RestrictedPython/compiler/transformer.py", line 948, in com_stmt
    result = self.com_node(node)
   File "/home/background/zopetest/lib/python/RestrictedPython/compiler/transformer.py", line 704, in com_node
    return self._dispatch[node[0]](node[1:])
   File "/home/background/zopetest/lib/python/RestrictedPython/compiler/transformer.py", line 230, in stmt
    return self.com_stmt(nodelist[0])
   File "/home/background/zopetest/lib/python/RestrictedPython/compiler/transformer.py", line 948, in com_stmt
    result = self.com_node(node)
   File "/home/background/zopetest/lib/python/RestrictedPython/compiler/transformer.py", line 704, in com_node
    return self._dispatch[node[0]](node[1:])
   File "/home/background/zopetest/lib/python/RestrictedPython/compiler/transformer.py", line 187, in funcdef
    code = self.com_node(nodelist[4])
   File "/home/background/zopetest/lib/python/RestrictedPython/compiler/transformer.py", line 704, in com_node
    return self._dispatch[node[0]](node[1:])
   File "/home/background/zopetest/lib/python/RestrictedPython/compiler/transformer.py", line 496, in suite
    self.com_append_stmt(stmts, node)
   File "/home/background/zopetest/lib/python/RestrictedPython/compiler/transformer.py", line 955, in com_append_stmt
    result = self.com_node(node)
   File "/home/background/zopetest/lib/python/RestrictedPython/compiler/transformer.py", line 704, in com_node
    return self._dispatch[node[0]](node[1:])
   File "/home/background/zopetest/lib/python/RestrictedPython/compiler/transformer.py", line 230, in stmt
    return self.com_stmt(nodelist[0])
   File "/home/background/zopetest/lib/python/RestrictedPython/compiler/transformer.py", line 948, in com_stmt
    result = self.com_node(node)
   File "/home/background/zopetest/lib/python/RestrictedPython/compiler/transformer.py", line 704, in com_node
    return self._dispatch[node[0]](node[1:])
   File "/home/background/zopetest/lib/python/RestrictedPython/compiler/transformer.py", line 240, in simple_stmt
    self.com_append_stmt(stmts, nodelist[i])
   File "/home/background/zopetest/lib/python/RestrictedPython/compiler/transformer.py", line 955, in com_append_stmt
    result = self.com_node(node)
   File "/home/background/zopetest/lib/python/RestrictedPython/compiler/transformer.py", line 704, in com_node
    return self._dispatch[node[0]](node[1:])
   File "/home/background/zopetest/lib/python/RestrictedPython/compiler/transformer.py", line 230, in stmt
    return self.com_stmt(nodelist[0])
   File "/home/background/zopetest/lib/python/RestrictedPython/compiler/transformer.py", line 948, in com_stmt
    result = self.com_node(node)
   File "/home/background/zopetest/lib/python/RestrictedPython/compiler/transformer.py", line 704, in com_node
    return self._dispatch[node[0]](node[1:])
   File "/home/background/zopetest/lib/python/RestrictedPython/compiler/transformer.py", line 277, in expr_stmt
    exprNode = self.com_node(nodelist[-1])
   File "/home/background/zopetest/lib/python/RestrictedPython/compiler/transformer.py", line 704, in com_node
    return self._dispatch[node[0]](node[1:])
   File "/home/background/zopetest/lib/python/RestrictedPython/compiler/transformer.py", line 507, in testlist
    return self.com_binary(Tuple, nodelist)
   File "/home/background/zopetest/lib/python/RestrictedPython/compiler/transformer.py", line 941, in com_binary
    return self.com_node(nodelist[0])
   File "/home/background/zopetest/lib/python/RestrictedPython/compiler/transformer.py", line 704, in com_node
    return self._dispatch[node[0]](node[1:])
   File "/home/background/zopetest/lib/python/RestrictedPython/compiler/transformer.py", line 515, in test
    return self.com_binary(Or, nodelist)
   File "/home/background/zopetest/lib/python/RestrictedPython/compiler/transformer.py", line 941, in com_binary
    return self.com_node(nodelist[0])
   File "/home/background/zopetest/lib/python/RestrictedPython/compiler/transformer.py", line 704, in com_node
    return self._dispatch[node[0]](node[1:])
   File "/home/background/zopetest/lib/python/RestrictedPython/compiler/transformer.py", line 519, in and_test
    return self.com_binary(And, nodelist)
   File "/home/background/zopetest/lib/python/RestrictedPython/compiler/transformer.py", line 941, in com_binary
    return self.com_node(nodelist[0])
   File "/home/background/zopetest/lib/python/RestrictedPython/compiler/transformer.py", line 704, in com_node
    return self._dispatch[node[0]](node[1:])
   File "/home/background/zopetest/lib/python/RestrictedPython/compiler/transformer.py", line 523, in not_test
    result = self.com_node(nodelist[-1])
   File "/home/background/zopetest/lib/python/RestrictedPython/compiler/transformer.py", line 704, in com_node
    return self._dispatch[node[0]](node[1:])
   File "/home/background/zopetest/lib/python/RestrictedPython/compiler/transformer.py", line 532, in comparison
    node = self.com_node(nodelist[0])
   File "/home/background/zopetest/lib/python/RestrictedPython/compiler/transformer.py", line 704, in com_node
    return self._dispatch[node[0]](node[1:])
   File "/home/background/zopetest/lib/python/RestrictedPython/compiler/transformer.py", line 567, in expr
    return self.com_binary(Bitor, nodelist)
   File "/home/background/zopetest/lib/python/RestrictedPython/compiler/transformer.py", line 941, in com_binary
    return self.com_node(nodelist[0])
   File "/home/background/zopetest/lib/python/RestrictedPython/compiler/transformer.py", line 704, in com_node
    return self._dispatch[node[0]](node[1:])
   File "/home/background/zopetest/lib/python/RestrictedPython/compiler/transformer.py", line 571, in xor_expr
    return self.com_binary(Bitxor, nodelist)
   File "/home/background/zopetest/lib/python/RestrictedPython/compiler/transformer.py", line 941, in com_binary
    return self.com_node(nodelist[0])
   File "/home/background/zopetest/lib/python/RestrictedPython/compiler/transformer.py", line 704, in com_node
    return self._dispatch[node[0]](node[1:])
   File "/home/background/zopetest/lib/python/RestrictedPython/compiler/transformer.py", line 575, in and_expr
    return self.com_binary(Bitand, nodelist)
   File "/home/background/zopetest/lib/python/RestrictedPython/compiler/transformer.py", line 941, in com_binary
    return self.com_node(nodelist[0])
   File "/home/background/zopetest/lib/python/RestrictedPython/compiler/transformer.py", line 704, in com_node
    return self._dispatch[node[0]](node[1:])
   File "/home/background/zopetest/lib/python/RestrictedPython/compiler/transformer.py", line 579, in shift_expr
    node = self.com_node(nodelist[0])
   File "/home/background/zopetest/lib/python/RestrictedPython/compiler/transformer.py", line 704, in com_node
    return self._dispatch[node[0]](node[1:])
   File "/home/background/zopetest/lib/python/RestrictedPython/compiler/transformer.py", line 591, in arith_expr
    node = self.com_node(nodelist[0])
   File "/home/background/zopetest/lib/python/RestrictedPython/compiler/transformer.py", line 704, in com_node
    return self._dispatch[node[0]](node[1:])
   File "/home/background/zopetest/lib/python/RestrictedPython/compiler/transformer.py", line 603, in term
    node = self.com_node(nodelist[0])
   File "/home/background/zopetest/lib/python/RestrictedPython/compiler/transformer.py", line 704, in com_node
    return self._dispatch[node[0]](node[1:])
   File "/home/background/zopetest/lib/python/RestrictedPython/compiler/transformer.py", line 619, in factor
    node = self.com_node(nodelist[-1])
   File "/home/background/zopetest/lib/python/RestrictedPython/compiler/transformer.py", line 704, in com_node
    return self._dispatch[node[0]](node[1:])
   File "/home/background/zopetest/lib/python/RestrictedPython/compiler/transformer.py", line 633, in power
    node = self.com_node(nodelist[0])
   File "/home/background/zopetest/lib/python/RestrictedPython/compiler/transformer.py", line 704, in com_node
    return self._dispatch[node[0]](node[1:])
   File "/home/background/zopetest/lib/python/RestrictedPython/compiler/transformer.py", line 646, in atom
    return self._atom_dispatch[nodelist[0][0]](nodelist)
   File "/home/background/zopetest/lib/python/RestrictedPython/compiler/transformer.py", line 660, in atom_lsqb
    return self.com_list_constructor(nodelist[1])
   File "/home/background/zopetest/lib/python/RestrictedPython/compiler/transformer.py", line 970, in com_list_constructor
    nodelist[i])
   File "/home/background/zopetest/lib/python/RestrictedPython/compiler/transformer.py", line 989, in com_list_comprehension
    listNode = self.com_node(node[4])
   File "/home/background/zopetest/lib/python/RestrictedPython/compiler/transformer.py", line 704, in com_node
    return self._dispatch[node[0]](node[1:])


/home/background/zopetest/lib/python/TAL/TALInterpreter.py:421: DeprecationWarning: strop functions are obsolete; use string methods
  i = rfind(s, '\n')
/home/background/zopetest/lib/python/TAL/TALInterpreter.py:293: DeprecationWarning: strop functions are obsolete; use string methods
  if self.html and lower(name) in BOOLEAN_HTML_ATTRS:
/home/background/zopetest/lib/python/TAL/TALInterpreter.py:269: DeprecationWarning: strop functions are obsolete; use string methods
  i = rfind(name, ":") + 1
======================================================================
ERROR: testAqWrappedObjectsFail (testSessionDataManager.TestSessionManager)
----------------------------------------------------------------------
Traceback (most recent call last):
  File "/home/background/zopetest/lib/python/Products/Sessions/tests/testSessionDataManager.py", line 205, in testAqWrappedObjectsFail
    sd = self.app.session_data_manager.getSessionData()
  File "/home/background/zopetest/lib/python/Products/Sessions/SessionDataManager.py", line 88, in getSessionData
    key = self.getBrowserIdManager().getBrowserId(create=create)
  File "/home/background/zopetest/lib/python/Products/Sessions/BrowserIdManager.py", line 112, in getBrowserId
    bid = getattr(REQUEST, 'browser_id_', None)
  File "/home/background/zopetest/lib/python/ZPublisher/HTTPRequest.py", line 848, in __getitem__
    raise KeyError, key
KeyError: browser_id_

======================================================================
ERROR: testBadExternalSDCPath (testSessionDataManager.TestSessionManager)
----------------------------------------------------------------------
Traceback (most recent call last):
  File "/home/background/zopetest/lib/python/Products/Sessions/tests/testSessionDataManager.py", line 166, in testBadExternalSDCPath
    self.assertRaises(SessionDataManagerErr, self._testbadsdcpath)
  File "/usr/local/lib/python2.2/unittest.py", line 273, in failUnlessRaises
    apply(callableObj, args, kwargs)
  File "/home/background/zopetest/lib/python/Products/Sessions/tests/testSessionDataManager.py", line 169, in _testbadsdcpath
    self.app.session_data_manager.getSessionData()
  File "/home/background/zopetest/lib/python/Products/Sessions/SessionDataManager.py", line 88, in getSessionData
    key = self.getBrowserIdManager().getBrowserId(create=create)
  File "/home/background/zopetest/lib/python/Products/Sessions/BrowserIdManager.py", line 112, in getBrowserId
    bid = getattr(REQUEST, 'browser_id_', None)
  File "/home/background/zopetest/lib/python/ZPublisher/HTTPRequest.py", line 848, in __getitem__
    raise KeyError, key
KeyError: browser_id_

======================================================================
ERROR: testBrowserIdIsSet (testSessionDataManager.TestSessionManager)
----------------------------------------------------------------------
Traceback (most recent call last):
  File "/home/background/zopetest/lib/python/Products/Sessions/tests/testSessionDataManager.py", line 150, in testBrowserIdIsSet
    sd = self.app.session_data_manager.getSessionData()
  File "/home/background/zopetest/lib/python/Products/Sessions/SessionDataManager.py", line 88, in getSessionData
    key = self.getBrowserIdManager().getBrowserId(create=create)
  File "/home/background/zopetest/lib/python/Products/Sessions/BrowserIdManager.py", line 112, in getBrowserId
    bid = getattr(REQUEST, 'browser_id_', None)
  File "/home/background/zopetest/lib/python/ZPublisher/HTTPRequest.py", line 848, in __getitem__
    raise KeyError, key
KeyError: browser_id_

======================================================================
ERROR: testForeignObject (testSessionDataManager.TestSessionManager)
----------------------------------------------------------------------
Traceback (most recent call last):
  File "/home/background/zopetest/lib/python/Products/Sessions/tests/testSessionDataManager.py", line 193, in testForeignObject
    self.assertRaises(InvalidObjectReference, self._foreignAdd)
  File "/usr/local/lib/python2.2/unittest.py", line 273, in failUnlessRaises
    apply(callableObj, args, kwargs)
  File "/home/background/zopetest/lib/python/Products/Sessions/tests/testSessionDataManager.py", line 197, in _foreignAdd
    sd = self.app.session_data_manager.getSessionData()
  File "/home/background/zopetest/lib/python/Products/Sessions/SessionDataManager.py", line 88, in getSessionData
    key = self.getBrowserIdManager().getBrowserId(create=create)
  File "/home/background/zopetest/lib/python/Products/Sessions/BrowserIdManager.py", line 112, in getBrowserId
    bid = getattr(REQUEST, 'browser_id_', None)
  File "/home/background/zopetest/lib/python/ZPublisher/HTTPRequest.py", line 848, in __getitem__
    raise KeyError, key
KeyError: browser_id_

======================================================================
ERROR: testGetSessionDataByKey (testSessionDataManager.TestSessionManager)
----------------------------------------------------------------------
Traceback (most recent call last):
  File "/home/background/zopetest/lib/python/Products/Sessions/tests/testSessionDataManager.py", line 155, in testGetSessionDataByKey
    sd = self.app.session_data_manager.getSessionData()
  File "/home/background/zopetest/lib/python/Products/Sessions/SessionDataManager.py", line 88, in getSessionData
    key = self.getBrowserIdManager().getBrowserId(create=create)
  File "/home/background/zopetest/lib/python/Products/Sessions/BrowserIdManager.py", line 112, in getBrowserId
    bid = getattr(REQUEST, 'browser_id_', None)
  File "/home/background/zopetest/lib/python/ZPublisher/HTTPRequest.py", line 848, in __getitem__
    raise KeyError, key
KeyError: browser_id_

======================================================================
ERROR: testGetSessionDataCreate (testSessionDataManager.TestSessionManager)
----------------------------------------------------------------------
Traceback (most recent call last):
  File "/home/background/zopetest/lib/python/Products/Sessions/tests/testSessionDataManager.py", line 125, in testGetSessionDataCreate
    sd = self.app.session_data_manager.getSessionData(1)
  File "/home/background/zopetest/lib/python/Products/Sessions/SessionDataManager.py", line 88, in getSessionData
    key = self.getBrowserIdManager().getBrowserId(create=create)
  File "/home/background/zopetest/lib/python/Products/Sessions/BrowserIdManager.py", line 112, in getBrowserId
    bid = getattr(REQUEST, 'browser_id_', None)
  File "/home/background/zopetest/lib/python/ZPublisher/HTTPRequest.py", line 848, in __getitem__
    raise KeyError, key
KeyError: browser_id_

======================================================================
ERROR: testGetSessionDataNoCreate (testSessionDataManager.TestSessionManager)
----------------------------------------------------------------------
Traceback (most recent call last):
  File "/home/background/zopetest/lib/python/Products/Sessions/tests/testSessionDataManager.py", line 121, in testGetSessionDataNoCreate
    sd = self.app.session_data_manager.getSessionData(0)
  File "/home/background/zopetest/lib/python/Products/Sessions/SessionDataManager.py", line 88, in getSessionData
    key = self.getBrowserIdManager().getBrowserId(create=create)
  File "/home/background/zopetest/lib/python/Products/Sessions/BrowserIdManager.py", line 112, in getBrowserId
    bid = getattr(REQUEST, 'browser_id_', None)
  File "/home/background/zopetest/lib/python/ZPublisher/HTTPRequest.py", line 848, in __getitem__
    raise KeyError, key
KeyError: browser_id_

======================================================================
ERROR: testGhostUnghostSessionManager (testSessionDataManager.TestSessionManager)
----------------------------------------------------------------------
Traceback (most recent call last):
  File "/home/background/zopetest/lib/python/Products/Sessions/tests/testSessionDataManager.py", line 181, in testGhostUnghostSessionManager
    sd = sdm.getSessionData()
  File "/home/background/zopetest/lib/python/Products/Sessions/SessionDataManager.py", line 88, in getSessionData
    key = self.getBrowserIdManager().getBrowserId(create=create)
  File "/home/background/zopetest/lib/python/Products/Sessions/BrowserIdManager.py", line 112, in getBrowserId
    bid = getattr(REQUEST, 'browser_id_', None)
  File "/home/background/zopetest/lib/python/ZPublisher/HTTPRequest.py", line 848, in __getitem__
    raise KeyError, key
KeyError: browser_id_

======================================================================
ERROR: testHasSessionData (testSessionDataManager.TestSessionManager)
----------------------------------------------------------------------
Traceback (most recent call last):
  File "/home/background/zopetest/lib/python/Products/Sessions/tests/testSessionDataManager.py", line 129, in testHasSessionData
    sd = self.app.session_data_manager.getSessionData()
  File "/home/background/zopetest/lib/python/Products/Sessions/SessionDataManager.py", line 88, in getSessionData
    key = self.getBrowserIdManager().getBrowserId(create=create)
  File "/home/background/zopetest/lib/python/Products/Sessions/BrowserIdManager.py", line 112, in getBrowserId
    bid = getattr(REQUEST, 'browser_id_', None)
  File "/home/background/zopetest/lib/python/ZPublisher/HTTPRequest.py", line 848, in __getitem__
    raise KeyError, key
KeyError: browser_id_

======================================================================
ERROR: testInvalidateSessionDataObject (testSessionDataManager.TestSessionManager)
----------------------------------------------------------------------
Traceback (most recent call last):
  File "/home/background/zopetest/lib/python/Products/Sessions/tests/testSessionDataManager.py", line 173, in testInvalidateSessionDataObject
    sd = sdm.getSessionData()
  File "/home/background/zopetest/lib/python/Products/Sessions/SessionDataManager.py", line 88, in getSessionData
    key = self.getBrowserIdManager().getBrowserId(create=create)
  File "/home/background/zopetest/lib/python/Products/Sessions/BrowserIdManager.py", line 112, in getBrowserId
    bid = getattr(REQUEST, 'browser_id_', None)
  File "/home/background/zopetest/lib/python/ZPublisher/HTTPRequest.py", line 848, in __getitem__
    raise KeyError, key
KeyError: browser_id_

======================================================================
ERROR: testNewSessionDataObjectIsValid (testSessionDataManager.TestSessionManager)
----------------------------------------------------------------------
Traceback (most recent call last):
  File "/home/background/zopetest/lib/python/Products/Sessions/tests/testSessionDataManager.py", line 139, in testNewSessionDataObjectIsValid
    sd = self.app.session_data_manager.getSessionData()
  File "/home/background/zopetest/lib/python/Products/Sessions/SessionDataManager.py", line 88, in getSessionData
    key = self.getBrowserIdManager().getBrowserId(create=create)
  File "/home/background/zopetest/lib/python/Products/Sessions/BrowserIdManager.py", line 112, in getBrowserId
    bid = getattr(REQUEST, 'browser_id_', None)
  File "/home/background/zopetest/lib/python/ZPublisher/HTTPRequest.py", line 848, in __getitem__
    raise KeyError, key
KeyError: browser_id_

======================================================================
ERROR: testSessionDataWrappedInSDM (testSessionDataManager.TestSessionManager)
----------------------------------------------------------------------
Traceback (most recent call last):
  File "/home/background/zopetest/lib/python/Products/Sessions/tests/testSessionDataManager.py", line 133, in testSessionDataWrappedInSDM
    sd = self.app.session_data_manager.getSessionData(1)
  File "/home/background/zopetest/lib/python/Products/Sessions/SessionDataManager.py", line 88, in getSessionData
    key = self.getBrowserIdManager().getBrowserId(create=create)
  File "/home/background/zopetest/lib/python/Products/Sessions/BrowserIdManager.py", line 112, in getBrowserId
    bid = getattr(REQUEST, 'browser_id_', None)
  File "/home/background/zopetest/lib/python/ZPublisher/HTTPRequest.py", line 848, in __getitem__
    raise KeyError, key
KeyError: browser_id_

======================================================================
ERROR: testSubcommit (testSessionDataManager.TestSessionManager)
----------------------------------------------------------------------
Traceback (most recent call last):
  File "/home/background/zopetest/lib/python/Products/Sessions/tests/testSessionDataManager.py", line 188, in testSubcommit
    sd = self.app.session_data_manager.getSessionData()
  File "/home/background/zopetest/lib/python/Products/Sessions/SessionDataManager.py", line 88, in getSessionData
    key = self.getBrowserIdManager().getBrowserId(create=create)
  File "/home/background/zopetest/lib/python/Products/Sessions/BrowserIdManager.py", line 112, in getBrowserId
    bid = getattr(REQUEST, 'browser_id_', None)
  File "/home/background/zopetest/lib/python/ZPublisher/HTTPRequest.py", line 848, in __getitem__
    raise KeyError, key
KeyError: browser_id_

======================================================================
ERROR: testUnlazifyAutoPopulated (testSessionDataManager.TestSessionManager)
----------------------------------------------------------------------
Traceback (most recent call last):
  File "/home/background/zopetest/lib/python/Products/Sessions/tests/testSessionDataManager.py", line 219, in testUnlazifyAutoPopulated
    sess = self.app.REQUEST['TESTOFSESSION']
  File "/home/background/zopetest/lib/python/ZPublisher/HTTPRequest.py", line 841, in __getitem__
    if callable(v): v = v()
  File "/home/background/zopetest/lib/python/Products/Sessions/SessionDataManager.py", line 88, in getSessionData
    key = self.getBrowserIdManager().getBrowserId(create=create)
  File "/home/background/zopetest/lib/python/Products/Sessions/BrowserIdManager.py", line 112, in getBrowserId
    bid = getattr(REQUEST, 'browser_id_', None)
  File "/home/background/zopetest/lib/python/ZPublisher/HTTPRequest.py", line 848, in __getitem__
    raise KeyError, key
KeyError: browser_id_

======================================================================
ERROR: testBrowserIdIsNew (testBrowserIdManager.TestBrowserIdManager)
----------------------------------------------------------------------
Traceback (most recent call last):
  File "/home/background/zopetest/lib/python/Products/Sessions/tests/testBrowserIdManager.py", line 195, in testBrowserIdIsNew
    a = self.m.getBrowserId()
  File "/home/background/zopetest/lib/python/Products/Sessions/BrowserIdManager.py", line 112, in getBrowserId
    bid = getattr(REQUEST, 'browser_id_', None)
  File "/home/background/zopetest/lib/python/ZPublisher/HTTPRequest.py", line 848, in __getitem__
    raise KeyError, key
KeyError: browser_id_

======================================================================
ERROR: testEncodeUrl (testBrowserIdManager.TestBrowserIdManager)
----------------------------------------------------------------------
Traceback (most recent call last):
  File "/home/background/zopetest/lib/python/Products/Sessions/tests/testBrowserIdManager.py", line 269, in testEncodeUrl
    key = self.m.getBrowserId()
  File "/home/background/zopetest/lib/python/Products/Sessions/BrowserIdManager.py", line 112, in getBrowserId
    bid = getattr(REQUEST, 'browser_id_', None)
  File "/home/background/zopetest/lib/python/ZPublisher/HTTPRequest.py", line 848, in __getitem__
    raise KeyError, key
KeyError: browser_id_

======================================================================
ERROR: testFlushBrowserIdCookie (testBrowserIdManager.TestBrowserIdManager)
----------------------------------------------------------------------
Traceback (most recent call last):
  File "/home/background/zopetest/lib/python/Products/Sessions/tests/testBrowserIdManager.py", line 241, in testFlushBrowserIdCookie
    token = self.m.getBrowserId()
  File "/home/background/zopetest/lib/python/Products/Sessions/BrowserIdManager.py", line 112, in getBrowserId
    bid = getattr(REQUEST, 'browser_id_', None)
  File "/home/background/zopetest/lib/python/ZPublisher/HTTPRequest.py", line 848, in __getitem__
    raise KeyError, key
KeyError: browser_id_

======================================================================
ERROR: testGetBrowserIdCookie (testBrowserIdManager.TestBrowserIdManager)
----------------------------------------------------------------------
Traceback (most recent call last):
  File "/home/background/zopetest/lib/python/Products/Sessions/tests/testBrowserIdManager.py", line 170, in testGetBrowserIdCookie
    token = self.m.getBrowserId()
  File "/home/background/zopetest/lib/python/Products/Sessions/BrowserIdManager.py", line 112, in getBrowserId
    bid = getattr(REQUEST, 'browser_id_', None)
  File "/home/background/zopetest/lib/python/ZPublisher/HTTPRequest.py", line 848, in __getitem__
    raise KeyError, key
KeyError: browser_id_

======================================================================
ERROR: testHasBrowserId (testBrowserIdManager.TestBrowserIdManager)
----------------------------------------------------------------------
Traceback (most recent call last):
  File "/home/background/zopetest/lib/python/Products/Sessions/tests/testBrowserIdManager.py", line 190, in testHasBrowserId
    assert not self.m.hasBrowserId()
  File "/home/background/zopetest/lib/python/Products/Sessions/BrowserIdManager.py", line 98, in hasBrowserId
    if self.getBrowserId(create=0): return 1
  File "/home/background/zopetest/lib/python/Products/Sessions/BrowserIdManager.py", line 112, in getBrowserId
    bid = getattr(REQUEST, 'browser_id_', None)
  File "/home/background/zopetest/lib/python/ZPublisher/HTTPRequest.py", line 848, in __getitem__
    raise KeyError, key
KeyError: browser_id_

======================================================================
ERROR: testIsBrowserIdFromCookieFirst (testBrowserIdManager.TestBrowserIdManager)
----------------------------------------------------------------------
Traceback (most recent call last):
  File "/home/background/zopetest/lib/python/Products/Sessions/tests/testBrowserIdManager.py", line 199, in testIsBrowserIdFromCookieFirst
    token = self.m.getBrowserId()
  File "/home/background/zopetest/lib/python/Products/Sessions/BrowserIdManager.py", line 112, in getBrowserId
    bid = getattr(REQUEST, 'browser_id_', None)
  File "/home/background/zopetest/lib/python/ZPublisher/HTTPRequest.py", line 848, in __getitem__
    raise KeyError, key
KeyError: browser_id_

======================================================================
ERROR: testIsBrowserIdFromCookieOnly (testBrowserIdManager.TestBrowserIdManager)
----------------------------------------------------------------------
Traceback (most recent call last):
  File "/home/background/zopetest/lib/python/Products/Sessions/tests/testBrowserIdManager.py", line 219, in testIsBrowserIdFromCookieOnly
    token = self.m.getBrowserId()
  File "/home/background/zopetest/lib/python/Products/Sessions/BrowserIdManager.py", line 112, in getBrowserId
    bid = getattr(REQUEST, 'browser_id_', None)
  File "/home/background/zopetest/lib/python/ZPublisher/HTTPRequest.py", line 848, in __getitem__
    raise KeyError, key
KeyError: browser_id_

======================================================================
ERROR: testIsBrowserIdFromFormFirst (testBrowserIdManager.TestBrowserIdManager)
----------------------------------------------------------------------
Traceback (most recent call last):
  File "/home/background/zopetest/lib/python/Products/Sessions/tests/testBrowserIdManager.py", line 209, in testIsBrowserIdFromFormFirst
    token = self.m.getBrowserId()
  File "/home/background/zopetest/lib/python/Products/Sessions/BrowserIdManager.py", line 112, in getBrowserId
    bid = getattr(REQUEST, 'browser_id_', None)
  File "/home/background/zopetest/lib/python/ZPublisher/HTTPRequest.py", line 848, in __getitem__
    raise KeyError, key
KeyError: browser_id_

======================================================================
ERROR: testIsBrowserIdFromFormOnly (testBrowserIdManager.TestBrowserIdManager)
----------------------------------------------------------------------
Traceback (most recent call last):
  File "/home/background/zopetest/lib/python/Products/Sessions/tests/testBrowserIdManager.py", line 230, in testIsBrowserIdFromFormOnly
    token = self.m.getBrowserId()
  File "/home/background/zopetest/lib/python/Products/Sessions/BrowserIdManager.py", line 112, in getBrowserId
    bid = getattr(REQUEST, 'browser_id_', None)
  File "/home/background/zopetest/lib/python/ZPublisher/HTTPRequest.py", line 848, in __getitem__
    raise KeyError, key
KeyError: browser_id_

======================================================================
ERROR: testSetBrowserIdCookieByForce (testBrowserIdManager.TestBrowserIdManager)
----------------------------------------------------------------------
Traceback (most recent call last):
  File "/home/background/zopetest/lib/python/Products/Sessions/tests/testBrowserIdManager.py", line 254, in testSetBrowserIdCookieByForce
    token = self.m.getBrowserId()
  File "/home/background/zopetest/lib/python/Products/Sessions/BrowserIdManager.py", line 112, in getBrowserId
    bid = getattr(REQUEST, 'browser_id_', None)
  File "/home/background/zopetest/lib/python/ZPublisher/HTTPRequest.py", line 848, in __getitem__
    raise KeyError, key
KeyError: browser_id_

======================================================================
ERROR: testSetBrowserIdCreate (testBrowserIdManager.TestBrowserIdManager)
----------------------------------------------------------------------
Traceback (most recent call last):
  File "/home/background/zopetest/lib/python/Products/Sessions/tests/testBrowserIdManager.py", line 184, in testSetBrowserIdCreate
    a = self.m.getBrowserId(1)
  File "/home/background/zopetest/lib/python/Products/Sessions/BrowserIdManager.py", line 112, in getBrowserId
    bid = getattr(REQUEST, 'browser_id_', None)
  File "/home/background/zopetest/lib/python/ZPublisher/HTTPRequest.py", line 848, in __getitem__
    raise KeyError, key
KeyError: browser_id_

======================================================================
ERROR: testSetBrowserIdDontCreate (testBrowserIdManager.TestBrowserIdManager)
----------------------------------------------------------------------
Traceback (most recent call last):
  File "/home/background/zopetest/lib/python/Products/Sessions/tests/testBrowserIdManager.py", line 180, in testSetBrowserIdDontCreate
    a = self.m.getBrowserId(0)
  File "/home/background/zopetest/lib/python/Products/Sessions/BrowserIdManager.py", line 112, in getBrowserId
    bid = getattr(REQUEST, 'browser_id_', None)
  File "/home/background/zopetest/lib/python/ZPublisher/HTTPRequest.py", line 848, in __getitem__
    raise KeyError, key
KeyError: browser_id_

======================================================================
FAIL: testAutoReqPopulate (testSessionDataManager.TestSessionManager)
----------------------------------------------------------------------
Traceback (most recent call last):
  File "/home/background/zopetest/lib/python/Products/Sessions/tests/testSessionDataManager.py", line 213, in testAutoReqPopulate
    assert self.app.REQUEST.has_key('TESTOFSESSION')
AssertionError

----------------------------------------------------------------------
Ran 1080 tests in 162.326s

FAILED (failures=1, errors=26)

======================================================================
OVERALL FAILED (total failures=1, total errors=26)