[Zope-Coders] Zope test results
background@shane.zope.com
background@shane.zope.com
Wed, 19 Dec 2001 22:15:48 -0500 (EST)
**************************
Head
**************************
======================================================================
FAIL: checkStackSize (testRestrictions.RestrictionTests)
----------------------------------------------------------------------
Traceback (most recent call last):
File "/home/background/zopetest/lib/python/RestrictedPython/tests/testRestrictions.py", line 276, in checkStackSize
self.failUnless(
File "/usr/lib/python2.1/unittest.py", line 249, in failUnless
if not expr: raise self.failureException, msg
AssertionError: The stack size estimate for printToNone() should have been at least 4, but was only 3
----------------------------------------------------------------------
Ran 1094 tests in 163.535s
FAILED (failures=1)
======================================================================
OVERALL FAILED (total failures=1)
**************************
2.5 branch
**************************
Module testTemporaryStorage.py failed to load
exceptions.ImportError: No module named Mount
File "utilities/testrunner.py", line 60, in getSuiteFromFile
File "/home/background/zopetest/lib/python/Products/TemporaryFolder/tests/testTemporaryStorage.py", line 8, in ?
from Products.TemporaryFolder import TemporaryStorage
File "/home/background/zopetest/lib/python/Products/TemporaryFolder/__init__.py", line 20, in ?
import TemporaryFolder
File "/home/background/zopetest/lib/python/Products/TemporaryFolder/TemporaryFolder.py", line 20, in ?
from ZODB.Mount import MountPoint
Module testSessionDataManager.py failed to load
exceptions.ImportError: cannot import name MountedTemporaryFolder
File "utilities/testrunner.py", line 60, in getSuiteFromFile
File "/home/background/zopetest/lib/python/Products/Sessions/tests/testSessionDataManager.py", line 27, in ?
from Products.TemporaryFolder.TemporaryFolder import MountedTemporaryFolder
======================================================================
FAIL: checkStackSize (testRestrictions.RestrictionTests)
----------------------------------------------------------------------
Traceback (most recent call last):
File "/home/background/zopetest/lib/python/RestrictedPython/tests/testRestrictions.py", line 276, in checkStackSize
self.failUnless(
File "/usr/lib/python2.1/unittest.py", line 249, in failUnless
if not expr: raise self.failureException, msg
AssertionError: The stack size estimate for printToNone() should have been at least 4, but was only 3
----------------------------------------------------------------------
Ran 1044 tests in 151.826s
FAILED (failures=1)
======================================================================
OVERALL FAILED (total failures=1)
**************************
Head with Python 2.2c1+
**************************
Module testRestrictions.py failed to load
exceptions.KeyError: 314
File "utilities/testrunner.py", line 60, in getSuiteFromFile
File "/home/background/zopetest/lib/python/RestrictedPython/tests/testRestrictions.py", line 68, in ?
create_rmodule()
File "/home/background/zopetest/lib/python/RestrictedPython/tests/testRestrictions.py", line 59, in create_rmodule
code = compile_restricted(source, fn, 'exec')
File "/home/background/zopetest/lib/python/RestrictedPython/Compilers.py", line 141, in compile_restricted
r = compile_restricted_exec(source, filename)
File "/home/background/zopetest/lib/python/RestrictedPython/Compilers.py", line 84, in compile_restricted_exec
tree, err = tryParsing(s, 'exec')
File "/home/background/zopetest/lib/python/RestrictedPython/Compilers.py", line 38, in tryParsing
return parser(source), None
File "/home/background/zopetest/lib/python/RestrictedPython/compiler/transformer.py", line 109, in parsesuite
return self.transform(parser.suite(text))
File "/home/background/zopetest/lib/python/RestrictedPython/compiler/transformer.py", line 103, in transform
return self.compile_node(tree)
File "/home/background/zopetest/lib/python/RestrictedPython/compiler/transformer.py", line 132, in compile_node
return self.file_input(node[1:])
File "/home/background/zopetest/lib/python/RestrictedPython/compiler/transformer.py", line 163, in file_input
self.com_append_stmt(stmts, node)
File "/home/background/zopetest/lib/python/RestrictedPython/compiler/transformer.py", line 955, in com_append_stmt
result = self.com_node(node)
File "/home/background/zopetest/lib/python/RestrictedPython/compiler/transformer.py", line 704, in com_node
return self._dispatch[node[0]](node[1:])
File "/home/background/zopetest/lib/python/RestrictedPython/compiler/transformer.py", line 230, in stmt
return self.com_stmt(nodelist[0])
File "/home/background/zopetest/lib/python/RestrictedPython/compiler/transformer.py", line 948, in com_stmt
result = self.com_node(node)
File "/home/background/zopetest/lib/python/RestrictedPython/compiler/transformer.py", line 704, in com_node
return self._dispatch[node[0]](node[1:])
File "/home/background/zopetest/lib/python/RestrictedPython/compiler/transformer.py", line 230, in stmt
return self.com_stmt(nodelist[0])
File "/home/background/zopetest/lib/python/RestrictedPython/compiler/transformer.py", line 948, in com_stmt
result = self.com_node(node)
File "/home/background/zopetest/lib/python/RestrictedPython/compiler/transformer.py", line 704, in com_node
return self._dispatch[node[0]](node[1:])
File "/home/background/zopetest/lib/python/RestrictedPython/compiler/transformer.py", line 187, in funcdef
code = self.com_node(nodelist[4])
File "/home/background/zopetest/lib/python/RestrictedPython/compiler/transformer.py", line 704, in com_node
return self._dispatch[node[0]](node[1:])
File "/home/background/zopetest/lib/python/RestrictedPython/compiler/transformer.py", line 496, in suite
self.com_append_stmt(stmts, node)
File "/home/background/zopetest/lib/python/RestrictedPython/compiler/transformer.py", line 955, in com_append_stmt
result = self.com_node(node)
File "/home/background/zopetest/lib/python/RestrictedPython/compiler/transformer.py", line 704, in com_node
return self._dispatch[node[0]](node[1:])
File "/home/background/zopetest/lib/python/RestrictedPython/compiler/transformer.py", line 230, in stmt
return self.com_stmt(nodelist[0])
File "/home/background/zopetest/lib/python/RestrictedPython/compiler/transformer.py", line 948, in com_stmt
result = self.com_node(node)
File "/home/background/zopetest/lib/python/RestrictedPython/compiler/transformer.py", line 704, in com_node
return self._dispatch[node[0]](node[1:])
File "/home/background/zopetest/lib/python/RestrictedPython/compiler/transformer.py", line 240, in simple_stmt
self.com_append_stmt(stmts, nodelist[i])
File "/home/background/zopetest/lib/python/RestrictedPython/compiler/transformer.py", line 955, in com_append_stmt
result = self.com_node(node)
File "/home/background/zopetest/lib/python/RestrictedPython/compiler/transformer.py", line 704, in com_node
return self._dispatch[node[0]](node[1:])
File "/home/background/zopetest/lib/python/RestrictedPython/compiler/transformer.py", line 230, in stmt
return self.com_stmt(nodelist[0])
File "/home/background/zopetest/lib/python/RestrictedPython/compiler/transformer.py", line 948, in com_stmt
result = self.com_node(node)
File "/home/background/zopetest/lib/python/RestrictedPython/compiler/transformer.py", line 704, in com_node
return self._dispatch[node[0]](node[1:])
File "/home/background/zopetest/lib/python/RestrictedPython/compiler/transformer.py", line 277, in expr_stmt
exprNode = self.com_node(nodelist[-1])
File "/home/background/zopetest/lib/python/RestrictedPython/compiler/transformer.py", line 704, in com_node
return self._dispatch[node[0]](node[1:])
File "/home/background/zopetest/lib/python/RestrictedPython/compiler/transformer.py", line 507, in testlist
return self.com_binary(Tuple, nodelist)
File "/home/background/zopetest/lib/python/RestrictedPython/compiler/transformer.py", line 941, in com_binary
return self.com_node(nodelist[0])
File "/home/background/zopetest/lib/python/RestrictedPython/compiler/transformer.py", line 704, in com_node
return self._dispatch[node[0]](node[1:])
File "/home/background/zopetest/lib/python/RestrictedPython/compiler/transformer.py", line 515, in test
return self.com_binary(Or, nodelist)
File "/home/background/zopetest/lib/python/RestrictedPython/compiler/transformer.py", line 941, in com_binary
return self.com_node(nodelist[0])
File "/home/background/zopetest/lib/python/RestrictedPython/compiler/transformer.py", line 704, in com_node
return self._dispatch[node[0]](node[1:])
File "/home/background/zopetest/lib/python/RestrictedPython/compiler/transformer.py", line 519, in and_test
return self.com_binary(And, nodelist)
File "/home/background/zopetest/lib/python/RestrictedPython/compiler/transformer.py", line 941, in com_binary
return self.com_node(nodelist[0])
File "/home/background/zopetest/lib/python/RestrictedPython/compiler/transformer.py", line 704, in com_node
return self._dispatch[node[0]](node[1:])
File "/home/background/zopetest/lib/python/RestrictedPython/compiler/transformer.py", line 523, in not_test
result = self.com_node(nodelist[-1])
File "/home/background/zopetest/lib/python/RestrictedPython/compiler/transformer.py", line 704, in com_node
return self._dispatch[node[0]](node[1:])
File "/home/background/zopetest/lib/python/RestrictedPython/compiler/transformer.py", line 532, in comparison
node = self.com_node(nodelist[0])
File "/home/background/zopetest/lib/python/RestrictedPython/compiler/transformer.py", line 704, in com_node
return self._dispatch[node[0]](node[1:])
File "/home/background/zopetest/lib/python/RestrictedPython/compiler/transformer.py", line 567, in expr
return self.com_binary(Bitor, nodelist)
File "/home/background/zopetest/lib/python/RestrictedPython/compiler/transformer.py", line 941, in com_binary
return self.com_node(nodelist[0])
File "/home/background/zopetest/lib/python/RestrictedPython/compiler/transformer.py", line 704, in com_node
return self._dispatch[node[0]](node[1:])
File "/home/background/zopetest/lib/python/RestrictedPython/compiler/transformer.py", line 571, in xor_expr
return self.com_binary(Bitxor, nodelist)
File "/home/background/zopetest/lib/python/RestrictedPython/compiler/transformer.py", line 941, in com_binary
return self.com_node(nodelist[0])
File "/home/background/zopetest/lib/python/RestrictedPython/compiler/transformer.py", line 704, in com_node
return self._dispatch[node[0]](node[1:])
File "/home/background/zopetest/lib/python/RestrictedPython/compiler/transformer.py", line 575, in and_expr
return self.com_binary(Bitand, nodelist)
File "/home/background/zopetest/lib/python/RestrictedPython/compiler/transformer.py", line 941, in com_binary
return self.com_node(nodelist[0])
File "/home/background/zopetest/lib/python/RestrictedPython/compiler/transformer.py", line 704, in com_node
return self._dispatch[node[0]](node[1:])
File "/home/background/zopetest/lib/python/RestrictedPython/compiler/transformer.py", line 579, in shift_expr
node = self.com_node(nodelist[0])
File "/home/background/zopetest/lib/python/RestrictedPython/compiler/transformer.py", line 704, in com_node
return self._dispatch[node[0]](node[1:])
File "/home/background/zopetest/lib/python/RestrictedPython/compiler/transformer.py", line 591, in arith_expr
node = self.com_node(nodelist[0])
File "/home/background/zopetest/lib/python/RestrictedPython/compiler/transformer.py", line 704, in com_node
return self._dispatch[node[0]](node[1:])
File "/home/background/zopetest/lib/python/RestrictedPython/compiler/transformer.py", line 603, in term
node = self.com_node(nodelist[0])
File "/home/background/zopetest/lib/python/RestrictedPython/compiler/transformer.py", line 704, in com_node
return self._dispatch[node[0]](node[1:])
File "/home/background/zopetest/lib/python/RestrictedPython/compiler/transformer.py", line 619, in factor
node = self.com_node(nodelist[-1])
File "/home/background/zopetest/lib/python/RestrictedPython/compiler/transformer.py", line 704, in com_node
return self._dispatch[node[0]](node[1:])
File "/home/background/zopetest/lib/python/RestrictedPython/compiler/transformer.py", line 633, in power
node = self.com_node(nodelist[0])
File "/home/background/zopetest/lib/python/RestrictedPython/compiler/transformer.py", line 704, in com_node
return self._dispatch[node[0]](node[1:])
File "/home/background/zopetest/lib/python/RestrictedPython/compiler/transformer.py", line 646, in atom
return self._atom_dispatch[nodelist[0][0]](nodelist)
File "/home/background/zopetest/lib/python/RestrictedPython/compiler/transformer.py", line 660, in atom_lsqb
return self.com_list_constructor(nodelist[1])
File "/home/background/zopetest/lib/python/RestrictedPython/compiler/transformer.py", line 970, in com_list_constructor
nodelist[i])
File "/home/background/zopetest/lib/python/RestrictedPython/compiler/transformer.py", line 989, in com_list_comprehension
listNode = self.com_node(node[4])
File "/home/background/zopetest/lib/python/RestrictedPython/compiler/transformer.py", line 704, in com_node
return self._dispatch[node[0]](node[1:])
/home/background/zopetest/lib/python/TAL/TALInterpreter.py:421: DeprecationWarning: strop functions are obsolete; use string methods
i = rfind(s, '\n')
/home/background/zopetest/lib/python/TAL/TALInterpreter.py:293: DeprecationWarning: strop functions are obsolete; use string methods
if self.html and lower(name) in BOOLEAN_HTML_ATTRS:
/home/background/zopetest/lib/python/TAL/TALInterpreter.py:269: DeprecationWarning: strop functions are obsolete; use string methods
i = rfind(name, ":") + 1
----------------------------------------------------------------------
Ran 1080 tests in 162.410s
OK