[Zope-Coders] Zope test results
background@shane.zope.com
background@shane.zope.com
Wed, 3 Apr 2002 22:26:05 -0500 (EST)
Zope2 tests include CMF, ZEO, and bsddb3Storage packages.
**********************************************************************
Zope CVS Head
**********************************************************************
FullTest.checkVersionIterator() temporarily disabled.
======================================================================
ERROR: checkUndoCommitVersion (testZEO.ZEOFileStorageTests)
----------------------------------------------------------------------
Traceback (most recent call last):
File "/home/background/zopetest/lib/python/ZODB/tests/TransactionalUndoVersionStorage.py", line 113, in checkUndoCommitVersion
revid = self._dostore(oid, revid, description='packable%d' % i)
TypeError: _dostore() got an unexpected keyword argument 'description'
======================================================================
ERROR: checkUndoAbortVersion (testZEO.ZEOFileStorageTests)
----------------------------------------------------------------------
Traceback (most recent call last):
File "/home/background/zopetest/lib/python/ZODB/tests/TransactionalUndoVersionStorage.py", line 160, in checkUndoAbortVersion
revid = self._dostore(oid, revid, description='packable%d' % i)
TypeError: _dostore() got an unexpected keyword argument 'description'
======================================================================
ERROR: test_BadCall (test_FSPageTemplate.FSPageTemplateTests)
----------------------------------------------------------------------
Traceback (most recent call last):
File "test_FSPageTemplate.py", line 33, in test_BadCall
File "/usr/lib/python2.1/unittest.py", line 260, in failUnlessRaises
apply(callableObj, args, kwargs)
File "/home/background/zopetest/lib/python/Shared/DC/Scripts/Bindings.py", line 252, in __call__
return self._bindAndExec(args, kw, None)
File "/home/background/zopetest/lib/python/Shared/DC/Scripts/Bindings.py", line 283, in _bindAndExec
return self._exec(bound_data, args, kw)
File "/home/background/zopetest/lib/python/Products/PageTemplates/ZopePageTemplate.py", line 209, in _exec
result = self.pt_render(extra_context=bound_names)
File "/home/background/zopetest/lib/python/Products/CMFCore/FSPageTemplate.py", line 124, in pt_render
source, extra_context )
File "/home/background/zopetest/lib/python/Products/PageTemplates/PageTemplate.py", line 91, in pt_render
tal=not source, strictinsert=0)()
File "/home/background/zopetest/lib/python/TAL/TALInterpreter.py", line 154, in __call__
self.interpret(self.program)
File "/home/background/zopetest/lib/python/TAL/TALInterpreter.py", line 187, in interpret
handlers[opcode](self, args)
File "/home/background/zopetest/lib/python/TAL/TALInterpreter.py", line 414, in do_insertText_tal
text = self.engine.evaluateText(stuff[0])
File "/home/background/zopetest/lib/python/Products/PageTemplates/TALES.py", line 228, in evaluateText
text = self.evaluate(expr)
File "/home/background/zopetest/lib/python/Products/PageTemplates/TALES.py", line 219, in evaluate
v = expression(self)
File "/home/background/zopetest/lib/python/Products/PageTemplates/Expressions.py", line 192, in __call__
return self._eval(econtext)
File "/home/background/zopetest/lib/python/Products/PageTemplates/Expressions.py", line 182, in _eval
ob = self._subexprs[-1](econtext)
File "/home/background/zopetest/lib/python/Products/PageTemplates/Expressions.py", line 141, in _eval
ob = restrictedTraverse(ob, path, getSecurityManager())
File "/home/background/zopetest/lib/python/Products/PageTemplates/Expressions.py", line 343, in restrictedTraverse
o = object[name]
File "/home/background/zopetest/lib/python/ZPublisher/HTTPRequest.py", line 860, in __getitem__
raise KeyError, key
KeyError: monkey
======================================================================
ERROR: test_BadCall (Products.CMFCore.tests.test_FSPageTemplate.FSPageTemplateTests)
----------------------------------------------------------------------
Traceback (most recent call last):
File "test_FSPageTemplate.py", line 33, in test_BadCall
File "/usr/lib/python2.1/unittest.py", line 260, in failUnlessRaises
apply(callableObj, args, kwargs)
File "/home/background/zopetest/lib/python/Shared/DC/Scripts/Bindings.py", line 252, in __call__
return self._bindAndExec(args, kw, None)
File "/home/background/zopetest/lib/python/Shared/DC/Scripts/Bindings.py", line 283, in _bindAndExec
return self._exec(bound_data, args, kw)
File "/home/background/zopetest/lib/python/Products/PageTemplates/ZopePageTemplate.py", line 209, in _exec
result = self.pt_render(extra_context=bound_names)
File "/home/background/zopetest/lib/python/Products/CMFCore/FSPageTemplate.py", line 124, in pt_render
source, extra_context )
File "/home/background/zopetest/lib/python/Products/PageTemplates/PageTemplate.py", line 91, in pt_render
tal=not source, strictinsert=0)()
File "/home/background/zopetest/lib/python/TAL/TALInterpreter.py", line 154, in __call__
self.interpret(self.program)
File "/home/background/zopetest/lib/python/TAL/TALInterpreter.py", line 187, in interpret
handlers[opcode](self, args)
File "/home/background/zopetest/lib/python/TAL/TALInterpreter.py", line 414, in do_insertText_tal
text = self.engine.evaluateText(stuff[0])
File "/home/background/zopetest/lib/python/Products/PageTemplates/TALES.py", line 228, in evaluateText
text = self.evaluate(expr)
File "/home/background/zopetest/lib/python/Products/PageTemplates/TALES.py", line 219, in evaluate
v = expression(self)
File "/home/background/zopetest/lib/python/Products/PageTemplates/Expressions.py", line 192, in __call__
return self._eval(econtext)
File "/home/background/zopetest/lib/python/Products/PageTemplates/Expressions.py", line 182, in _eval
ob = self._subexprs[-1](econtext)
File "/home/background/zopetest/lib/python/Products/PageTemplates/Expressions.py", line 141, in _eval
ob = restrictedTraverse(ob, path, getSecurityManager())
File "/home/background/zopetest/lib/python/Products/PageTemplates/Expressions.py", line 343, in restrictedTraverse
o = object[name]
File "/home/background/zopetest/lib/python/ZPublisher/HTTPRequest.py", line 860, in __getitem__
raise KeyError, key
KeyError: monkey
======================================================================
FAIL: testExceptionInSubAbortSub (testTransaction.TransactionTests)
----------------------------------------------------------------------
Traceback (most recent call last):
File "testTransaction.py", line 494, in testExceptionInSubAbortSub
AssertionError
----------------------------------------------------------------------
Ran 1830 tests in 302.669s
FAILED (failures=1, errors=4)
======================================================================
OVERALL FAILED (total failures=1, total errors=4)
**********************************************************************
Zope 2.5 branch
**********************************************************************
FullTest.checkVersionIterator() temporarily disabled.
======================================================================
ERROR: checkUndoCommitVersion (testZEO.ZEOFileStorageTests)
----------------------------------------------------------------------
Traceback (most recent call last):
File "/home/background/zopetest/lib/python/ZODB/tests/TransactionalUndoVersionStorage.py", line 113, in checkUndoCommitVersion
revid = self._dostore(oid, revid, description='packable%d' % i)
TypeError: _dostore() got an unexpected keyword argument 'description'
======================================================================
ERROR: checkUndoAbortVersion (testZEO.ZEOFileStorageTests)
----------------------------------------------------------------------
Traceback (most recent call last):
File "/home/background/zopetest/lib/python/ZODB/tests/TransactionalUndoVersionStorage.py", line 160, in checkUndoAbortVersion
revid = self._dostore(oid, revid, description='packable%d' % i)
TypeError: _dostore() got an unexpected keyword argument 'description'
======================================================================
ERROR: test_BadCall (test_FSPageTemplate.FSPageTemplateTests)
----------------------------------------------------------------------
Traceback (most recent call last):
File "test_FSPageTemplate.py", line 33, in test_BadCall
File "/usr/lib/python2.1/unittest.py", line 260, in failUnlessRaises
apply(callableObj, args, kwargs)
File "/home/background/zopetest/lib/python/Shared/DC/Scripts/Bindings.py", line 252, in __call__
return self._bindAndExec(args, kw, None)
File "/home/background/zopetest/lib/python/Shared/DC/Scripts/Bindings.py", line 283, in _bindAndExec
return self._exec(bound_data, args, kw)
File "/home/background/zopetest/lib/python/Products/PageTemplates/ZopePageTemplate.py", line 209, in _exec
result = self.pt_render(extra_context=bound_names)
File "/home/background/zopetest/lib/python/Products/CMFCore/FSPageTemplate.py", line 124, in pt_render
source, extra_context )
File "/home/background/zopetest/lib/python/Products/PageTemplates/PageTemplate.py", line 91, in pt_render
tal=not source, strictinsert=0)()
File "/home/background/zopetest/lib/python/TAL/TALInterpreter.py", line 154, in __call__
self.interpret(self.program)
File "/home/background/zopetest/lib/python/TAL/TALInterpreter.py", line 187, in interpret
handlers[opcode](self, args)
File "/home/background/zopetest/lib/python/TAL/TALInterpreter.py", line 414, in do_insertText_tal
text = self.engine.evaluateText(stuff[0])
File "/home/background/zopetest/lib/python/Products/PageTemplates/TALES.py", line 228, in evaluateText
text = self.evaluate(expr)
File "/home/background/zopetest/lib/python/Products/PageTemplates/TALES.py", line 219, in evaluate
v = expression(self)
File "/home/background/zopetest/lib/python/Products/PageTemplates/Expressions.py", line 192, in __call__
return self._eval(econtext)
File "/home/background/zopetest/lib/python/Products/PageTemplates/Expressions.py", line 182, in _eval
ob = self._subexprs[-1](econtext)
File "/home/background/zopetest/lib/python/Products/PageTemplates/Expressions.py", line 141, in _eval
ob = restrictedTraverse(ob, path, getSecurityManager())
File "/home/background/zopetest/lib/python/Products/PageTemplates/Expressions.py", line 343, in restrictedTraverse
o = object[name]
File "/home/background/zopetest/lib/python/ZPublisher/HTTPRequest.py", line 860, in __getitem__
raise KeyError, key
KeyError: monkey
======================================================================
ERROR: test_BadCall (Products.CMFCore.tests.test_FSPageTemplate.FSPageTemplateTests)
----------------------------------------------------------------------
Traceback (most recent call last):
File "test_FSPageTemplate.py", line 33, in test_BadCall
File "/usr/lib/python2.1/unittest.py", line 260, in failUnlessRaises
apply(callableObj, args, kwargs)
File "/home/background/zopetest/lib/python/Shared/DC/Scripts/Bindings.py", line 252, in __call__
return self._bindAndExec(args, kw, None)
File "/home/background/zopetest/lib/python/Shared/DC/Scripts/Bindings.py", line 283, in _bindAndExec
return self._exec(bound_data, args, kw)
File "/home/background/zopetest/lib/python/Products/PageTemplates/ZopePageTemplate.py", line 209, in _exec
result = self.pt_render(extra_context=bound_names)
File "/home/background/zopetest/lib/python/Products/CMFCore/FSPageTemplate.py", line 124, in pt_render
source, extra_context )
File "/home/background/zopetest/lib/python/Products/PageTemplates/PageTemplate.py", line 91, in pt_render
tal=not source, strictinsert=0)()
File "/home/background/zopetest/lib/python/TAL/TALInterpreter.py", line 154, in __call__
self.interpret(self.program)
File "/home/background/zopetest/lib/python/TAL/TALInterpreter.py", line 187, in interpret
handlers[opcode](self, args)
File "/home/background/zopetest/lib/python/TAL/TALInterpreter.py", line 414, in do_insertText_tal
text = self.engine.evaluateText(stuff[0])
File "/home/background/zopetest/lib/python/Products/PageTemplates/TALES.py", line 228, in evaluateText
text = self.evaluate(expr)
File "/home/background/zopetest/lib/python/Products/PageTemplates/TALES.py", line 219, in evaluate
v = expression(self)
File "/home/background/zopetest/lib/python/Products/PageTemplates/Expressions.py", line 192, in __call__
return self._eval(econtext)
File "/home/background/zopetest/lib/python/Products/PageTemplates/Expressions.py", line 182, in _eval
ob = self._subexprs[-1](econtext)
File "/home/background/zopetest/lib/python/Products/PageTemplates/Expressions.py", line 141, in _eval
ob = restrictedTraverse(ob, path, getSecurityManager())
File "/home/background/zopetest/lib/python/Products/PageTemplates/Expressions.py", line 343, in restrictedTraverse
o = object[name]
File "/home/background/zopetest/lib/python/ZPublisher/HTTPRequest.py", line 860, in __getitem__
raise KeyError, key
KeyError: monkey
----------------------------------------------------------------------
Ran 1830 tests in 314.291s
FAILED (errors=4)
======================================================================
OVERALL FAILED (total errors=4)
**********************************************************************
Zope CVS Head with Python 2.2 (plus distutils-config-branch)
**********************************************************************
FullTest.checkVersionIterator() temporarily disabled.
======================================================================
ERROR: checkUndoAbortVersion (testZEO.ZEOFileStorageTests)
----------------------------------------------------------------------
Traceback (most recent call last):
File "/home/background/zopetest/lib/python/ZODB/tests/TransactionalUndoVersionStorage.py", line 160, in checkUndoAbortVersion
revid = self._dostore(oid, revid, description='packable%d' % i)
TypeError: _dostore() got an unexpected keyword argument 'description'
======================================================================
ERROR: checkUndoCommitVersion (testZEO.ZEOFileStorageTests)
----------------------------------------------------------------------
Traceback (most recent call last):
File "/home/background/zopetest/lib/python/ZODB/tests/TransactionalUndoVersionStorage.py", line 113, in checkUndoCommitVersion
revid = self._dostore(oid, revid, description='packable%d' % i)
TypeError: _dostore() got an unexpected keyword argument 'description'
======================================================================
ERROR: test_BadCall (test_FSPageTemplate.FSPageTemplateTests)
----------------------------------------------------------------------
Traceback (most recent call last):
File "test_FSPageTemplate.py", line 33, in test_BadCall
File "/usr/local/lib/python2.2/unittest.py", line 273, in failUnlessRaises
apply(callableObj, args, kwargs)
File "/home/background/zopetest/lib/python/Shared/DC/Scripts/Bindings.py", line 252, in __call__
return self._bindAndExec(args, kw, None)
File "/home/background/zopetest/lib/python/Shared/DC/Scripts/Bindings.py", line 283, in _bindAndExec
return self._exec(bound_data, args, kw)
File "/home/background/zopetest/lib/python/Products/PageTemplates/ZopePageTemplate.py", line 209, in _exec
result = self.pt_render(extra_context=bound_names)
File "/home/background/zopetest/lib/python/Products/CMFCore/FSPageTemplate.py", line 124, in pt_render
source, extra_context )
File "/home/background/zopetest/lib/python/Products/PageTemplates/PageTemplate.py", line 91, in pt_render
tal=not source, strictinsert=0)()
File "/home/background/zopetest/lib/python/TAL/TALInterpreter.py", line 154, in __call__
self.interpret(self.program)
File "/home/background/zopetest/lib/python/TAL/TALInterpreter.py", line 187, in interpret
handlers[opcode](self, args)
File "/home/background/zopetest/lib/python/TAL/TALInterpreter.py", line 414, in do_insertText_tal
text = self.engine.evaluateText(stuff[0])
File "/home/background/zopetest/lib/python/Products/PageTemplates/TALES.py", line 228, in evaluateText
text = self.evaluate(expr)
File "/home/background/zopetest/lib/python/Products/PageTemplates/TALES.py", line 219, in evaluate
v = expression(self)
File "/home/background/zopetest/lib/python/Products/PageTemplates/Expressions.py", line 192, in __call__
return self._eval(econtext)
File "/home/background/zopetest/lib/python/Products/PageTemplates/Expressions.py", line 182, in _eval
ob = self._subexprs[-1](econtext)
File "/home/background/zopetest/lib/python/Products/PageTemplates/Expressions.py", line 141, in _eval
ob = restrictedTraverse(ob, path, getSecurityManager())
File "/home/background/zopetest/lib/python/Products/PageTemplates/Expressions.py", line 343, in restrictedTraverse
o = object[name]
File "/home/background/zopetest/lib/python/ZPublisher/HTTPRequest.py", line 860, in __getitem__
raise KeyError, key
KeyError: monkey
======================================================================
ERROR: test_BadCall (Products.CMFCore.tests.test_FSPageTemplate.FSPageTemplateTests)
----------------------------------------------------------------------
Traceback (most recent call last):
File "test_FSPageTemplate.py", line 33, in test_BadCall
File "/usr/local/lib/python2.2/unittest.py", line 273, in failUnlessRaises
apply(callableObj, args, kwargs)
File "/home/background/zopetest/lib/python/Shared/DC/Scripts/Bindings.py", line 252, in __call__
return self._bindAndExec(args, kw, None)
File "/home/background/zopetest/lib/python/Shared/DC/Scripts/Bindings.py", line 283, in _bindAndExec
return self._exec(bound_data, args, kw)
File "/home/background/zopetest/lib/python/Products/PageTemplates/ZopePageTemplate.py", line 209, in _exec
result = self.pt_render(extra_context=bound_names)
File "/home/background/zopetest/lib/python/Products/CMFCore/FSPageTemplate.py", line 124, in pt_render
source, extra_context )
File "/home/background/zopetest/lib/python/Products/PageTemplates/PageTemplate.py", line 91, in pt_render
tal=not source, strictinsert=0)()
File "/home/background/zopetest/lib/python/TAL/TALInterpreter.py", line 154, in __call__
self.interpret(self.program)
File "/home/background/zopetest/lib/python/TAL/TALInterpreter.py", line 187, in interpret
handlers[opcode](self, args)
File "/home/background/zopetest/lib/python/TAL/TALInterpreter.py", line 414, in do_insertText_tal
text = self.engine.evaluateText(stuff[0])
File "/home/background/zopetest/lib/python/Products/PageTemplates/TALES.py", line 228, in evaluateText
text = self.evaluate(expr)
File "/home/background/zopetest/lib/python/Products/PageTemplates/TALES.py", line 219, in evaluate
v = expression(self)
File "/home/background/zopetest/lib/python/Products/PageTemplates/Expressions.py", line 192, in __call__
return self._eval(econtext)
File "/home/background/zopetest/lib/python/Products/PageTemplates/Expressions.py", line 182, in _eval
ob = self._subexprs[-1](econtext)
File "/home/background/zopetest/lib/python/Products/PageTemplates/Expressions.py", line 141, in _eval
ob = restrictedTraverse(ob, path, getSecurityManager())
File "/home/background/zopetest/lib/python/Products/PageTemplates/Expressions.py", line 343, in restrictedTraverse
o = object[name]
File "/home/background/zopetest/lib/python/ZPublisher/HTTPRequest.py", line 860, in __getitem__
raise KeyError, key
KeyError: monkey
----------------------------------------------------------------------
Ran 1832 tests in 306.000s
FAILED (errors=4)
======================================================================
OVERALL FAILED (total errors=4)