[Zope-Coders] Zope test results
background@shane.zope.com
background@shane.zope.com
Tue, 9 Apr 2002 22:24:20 -0400 (EDT)
Zope2 tests include the ZEO and bsddb3Storage packages.
**********************************************************************
Zope CVS Head with Python 2.1.3
**********************************************************************
FullTest.checkVersionIterator() temporarily disabled.
======================================================================
FAIL: testExceptionInSubAbortSub (testTransaction.TransactionTests)
----------------------------------------------------------------------
Traceback (most recent call last):
File "testTransaction.py", line 494, in testExceptionInSubAbortSub
AssertionError
----------------------------------------------------------------------
Ran 1381 tests in 300.982s
FAILED (failures=1)
======================================================================
OVERALL FAILED (total failures=1)
**********************************************************************
Zope 2.5 branch with Python 2.1.3
**********************************************************************
FullTest.checkVersionIterator() temporarily disabled.
----------------------------------------------------------------------
Ran 1381 tests in 294.268s
OK
**********************************************************************
Zope CVS Head with Python 2.2.1c2 (plus distutils-config-branch)
**********************************************************************
FullTest.checkVersionIterator() temporarily disabled.
----------------------------------------------------------------------
Ran 1383 tests in 286.420s
OK