[Zope-Coders] Zope test results

background@shane.zope.com background@shane.zope.com
Wed, 17 Apr 2002 22:24:25 -0400 (EDT)


Zope2 tests include the ZEO and bsddb3Storage packages.

**********************************************************************
Zope CVS Head with Python 2.1.3
**********************************************************************
FullTest.checkVersionIterator() temporarily disabled.
======================================================================
FAIL: checkBogusObject (testCache.CacheErrors)
----------------------------------------------------------------------
Traceback (most recent call last):
  File "testCache.py", line 240, in checkBogusObject
  File "/usr/lib/python2.1/unittest.py", line 266, in failUnlessRaises
    raise self.failureException, excName
AssertionError: Exception
----------------------------------------------------------------------
Ran 1393 tests in 302.658s

FAILED (failures=1)

======================================================================
OVERALL FAILED (total failures=1)

**********************************************************************
Zope 2.5 branch with Python 2.1.3
**********************************************************************
FullTest.checkVersionIterator() temporarily disabled.
======================================================================
FAIL: checkBogusObject (testCache.CacheErrors)
----------------------------------------------------------------------
Traceback (most recent call last):
  File "testCache.py", line 240, in checkBogusObject
  File "/usr/lib/python2.1/unittest.py", line 266, in failUnlessRaises
    raise self.failureException, excName
AssertionError: Exception
----------------------------------------------------------------------
Ran 1393 tests in 300.025s

FAILED (failures=1)

======================================================================
OVERALL FAILED (total failures=1)

**********************************************************************
Zope CVS Head with Python 2.2.1 (plus distutils-config-branch)
**********************************************************************
FullTest.checkVersionIterator() temporarily disabled.
======================================================================
FAIL: checkLRU (testCache.LRUCacheTests)
----------------------------------------------------------------------
Traceback (most recent call last):
  File "testCache.py", line 145, in checkLRU
  File "/usr/local/lib/python2.2/unittest.py", line 286, in failUnlessEqual
    raise self.failureException, \
AssertionError: 0 != None

======================================================================
FAIL: checkBogusObject (testCache.CacheErrors)
----------------------------------------------------------------------
Traceback (most recent call last):
  File "testCache.py", line 240, in checkBogusObject
  File "/usr/local/lib/python2.2/unittest.py", line 279, in failUnlessRaises
    raise self.failureException, excName
AssertionError: Exception

----------------------------------------------------------------------
Ran 1395 tests in 291.415s

FAILED (failures=2)

======================================================================
OVERALL FAILED (total failures=2)