[Zope-Coders] Zope test results

background@shane.zope.com background@shane.zope.com
Mon, 22 Apr 2002 22:24:13 -0400 (EDT)


Zope2 tests include the ZEO and bsddb3Storage packages.

**********************************************************************
Zope CVS Head with Python 2.1.3
**********************************************************************
FullTest.checkVersionIterator() temporarily disabled.
======================================================================
ERROR: testStorage (testExternalMethod.Test)
----------------------------------------------------------------------
Traceback (most recent call last):
  File "testExternalMethod.py", line 30, in setUp
AttributeError: __dict__
======================================================================
FAIL: checkDetail (testCache.LRUCacheTests)
----------------------------------------------------------------------
Traceback (most recent call last):
  File "testCache.py", line 180, in checkDetail
  File "/usr/lib/python2.1/unittest.py", line 273, in failUnlessEqual
    raise self.failureException, (msg or '%s != %s' % (first, second))
AssertionError: 4 != 3
----------------------------------------------------------------------
Ran 1397 tests in 296.763s

FAILED (failures=1, errors=1)

======================================================================
OVERALL FAILED (total failures=1, total errors=1)

**********************************************************************
Zope 2.5 branch with Python 2.1.3
**********************************************************************
FullTest.checkVersionIterator() temporarily disabled.
======================================================================
ERROR: testStorage (testExternalMethod.Test)
----------------------------------------------------------------------
Traceback (most recent call last):
  File "testExternalMethod.py", line 30, in setUp
AttributeError: __dict__
----------------------------------------------------------------------
Ran 1397 tests in 299.821s

FAILED (errors=1)

======================================================================
OVERALL FAILED (total errors=1)

**********************************************************************
Zope CVS Head with Python 2.2.1 (plus distutils-config-branch)
**********************************************************************
FullTest.checkVersionIterator() temporarily disabled.
======================================================================
ERROR: testStorage (testExternalMethod.Test)
----------------------------------------------------------------------
Traceback (most recent call last):
  File "testExternalMethod.py", line 30, in setUp
AttributeError: 'dict' object has no attribute '__dict__'

======================================================================
FAIL: checkLRU (testCache.LRUCacheTests)
----------------------------------------------------------------------
Traceback (most recent call last):
  File "testCache.py", line 145, in checkLRU
  File "/usr/local/lib/python2.2/unittest.py", line 286, in failUnlessEqual
    raise self.failureException, \
AssertionError: 0 != None

----------------------------------------------------------------------
Ran 1399 tests in 292.337s

FAILED (failures=1, errors=1)

======================================================================
OVERALL FAILED (total failures=1, total errors=1)