[Zope-Coders] Win32 Test Results failures:1

zope-tests@squishdot.org zope-tests@squishdot.org
Thu, 25 Apr 2002 02:15:14 +0100


==============================================================================
==============================================================================
Python Version:2.1.2 (#31, Jan 15 2002, 17:28:11) [MSC 32 bit (Intel)]

Modules included:
Zope (HEAD)
CMF/CMFCore (HEAD)
CMF/CMFCalendar (HEAD)
CMF/CMFCollector (HEAD)
CMF/CMFDecor (HEAD)
CMF/CMFDefault (HEAD)
CMF/CMFTopic (HEAD)
CMF/CMFTracker (HEAD)
CMF/CMFWiki (HEAD)
CMF/DCWorkflow (HEAD)

Module testDaemon.py failed to load
exceptions.ImportError: No module named posix
  File "Utilities/testrunner.py", line 60, in getSuiteFromFile
   File "testDaemon.py", line 25, in ?
    import zdaemon
   File "E:\ZopeTests\sandbox\Zope\lib\python\zdaemon\__init__.py", line 37, in ?
    from Daemon import run
   File "E:\ZopeTests\sandbox\Zope\lib\python\zdaemon\Daemon.py", line 15, in ?
    import os, sys, time, signal, posix


----------------------------------------------------------------------
Ran 1680 tests in 239.805s

OK
==============================================================================
==============================================================================
Python Version:2.1.2 (#31, Jan 15 2002, 17:28:11) [MSC 32 bit (Intel)]

Modules included:
Zope (Zope-2_5-branch)

======================================================================
FAIL: check_simple_html (test_xmlparser.XMLParserTestCase)
----------------------------------------------------------------------
Traceback (most recent call last):
  File "test_xmlparser.py", line 114, in check_simple_html
  File "test_xmlparser.py", line 95, in _run_check
  File "c:\python21\lib\unittest.py", line 249, in failUnless
    if not expr: raise self.failureException, msg
AssertionError: [('starttag', u'html', []), ('data', u' \n'), ('comment', u'comment1a\n-></foo><bar>&lt;<?pi?></foo<bar\ncomment1b'), ('data', u'\n'), ('starttag', u'img', [u'src', u'Bar', u'ismap', u'']), ('endtag', u'img'), ('data', u'sample\ntext\n'), ('comment', u'comment2a- -comment2b'), ('data', u'\n'), ('endtag', u'html')]
----------------------------------------------------------------------
Ran 1158 tests in 192.797s

FAILED (failures=1)

======================================================================
OVERALL FAILED (total failures=1)