[Zope-Coders] Test failures on 2.5.1 :-/

Matt Behrens matt@zigg.com
Thu, 25 Apr 2002 14:23:41 -0400


Platform is OpenBSD 3.1-current.  This is Zope-2.5.1-src *only*.

======================================================================
ERROR: testStorage (testExternalMethod.Test)
----------------------------------------------------------------------
Traceback (most recent call last):
  File "testExternalMethod.py", line 30, in setUp
AttributeError: __dict__
======================================================================
ERROR: test_mapply (testExternalMethod.Test)
----------------------------------------------------------------------
Traceback (most recent call last):
  File "testExternalMethod.py", line 30, in setUp
AttributeError: __dict__
----------------------------------------------------------------------
Ran 1134 tests in 234.258s

FAILED (errors=2)

======================================================================
OVERALL FAILED (total errors=2)