[Zope-Coders] Zope test results
background@shane.zope.com
background@shane.zope.com
Thu, 25 Apr 2002 22:24:02 -0400 (EDT)
Zope2 tests include the ZEO and bsddb3Storage packages.
**********************************************************************
Zope CVS Head with Python 2.1.3
**********************************************************************
FullTest.checkVersionIterator() temporarily disabled.
----------------------------------------------------------------------
Ran 1401 tests in 291.162s
OK
**********************************************************************
Zope 2.5 branch with Python 2.1.3
**********************************************************************
FullTest.checkVersionIterator() temporarily disabled.
----------------------------------------------------------------------
Ran 1401 tests in 293.105s
OK
**********************************************************************
Zope CVS Head with Python 2.2.1 (plus distutils-config-branch)
**********************************************************************
FullTest.checkVersionIterator() temporarily disabled.
======================================================================
FAIL: checkLRU (testCache.LRUCacheTests)
----------------------------------------------------------------------
Traceback (most recent call last):
File "testCache.py", line 145, in checkLRU
File "/usr/local/lib/python2.2/unittest.py", line 286, in failUnlessEqual
raise self.failureException, \
AssertionError: 0 != None
----------------------------------------------------------------------
Ran 1403 tests in 294.709s
FAILED (failures=1)
======================================================================
OVERALL FAILED (total failures=1)