[Zope-Coders] Linux Test Results - Zope HEAD + CMF HEAD - failures:13 errors:3

zope-tests@squishdot.org zope-tests@squishdot.org
Thu, 08 Aug 2002 10:47:13 +0100


==============================================================================
==============================================================================
Python Version:2.1.3 (#1, May 20 2002, 12:02:16) 
[GCC 2.95.2 20000220 (Debian GNU/Linux)]

Modules included:
Zope (HEAD)
CMF/CMFCore (HEAD)
CMF/CMFCalendar (HEAD)
CMF/CMFDefault (HEAD)
CMF/CMFTopic (HEAD)
CMF/DCWorkflow (HEAD)

Traceback (most recent call last):
  File "/stuff/chrisw/ZopeTests/sandbox/Zope/lib/python/TAL/runtest.py", line 92, in main
    driver.main()
  File "/stuff/chrisw/ZopeTests/sandbox/Zope/lib/python/TAL/driver.py", line 77, in main
    it = compilefile(file, mode)
  File "/stuff/chrisw/ZopeTests/sandbox/Zope/lib/python/TAL/driver.py", line 106, in compilefile
    p.parseFile(file)
  File "/stuff/chrisw/ZopeTests/sandbox/Zope/lib/python/TAL/XMLParser.py", line 77, in parseFile
    self.parseStream(open(filename))
  File "/stuff/chrisw/ZopeTests/sandbox/Zope/lib/python/TAL/XMLParser.py", line 87, in parseStream
    self.parser.ParseFile(stream)
ExpatError: undefined entity: line 18, column 2
======================================================================
ERROR: check_simple_html (test_xmlparser.XMLParserTestCase)
----------------------------------------------------------------------
Traceback (most recent call last):
  File "test_xmlparser.py", line 117, in check_simple_html
  File "test_xmlparser.py", line 94, in _run_check
  File "/stuff/chrisw/ZopeTests/sandbox/Zope/lib/python/TAL/XMLParser.py", line 80, in parseString
    self.parser.Parse(s, 1)
ExpatError: undefined entity: line 3, column 6
======================================================================
ERROR: test_DeleteAddEditMethod (Products.CMFCore.tests.test_DirectoryView.DebugModeTests)
----------------------------------------------------------------------
Traceback (most recent call last):
  File "/stuff/chrisw/ZopeTests/sandbox/Zope/lib/python/Products/CMFCore/tests/test_DirectoryView.py", line 210, in test_DeleteAddEditMethod
    self.assertEqual(self.ob.fake_skin.test2(),'test2.2')
AttributeError: test2
======================================================================
ERROR: test_DeleteAddEditMethod (test_DirectoryView.DebugModeTests)
----------------------------------------------------------------------
Traceback (most recent call last):
  File "/stuff/chrisw/ZopeTests/sandbox/Zope/lib/python/Products/CMFCore/tests/test_DirectoryView.py", line 210, in test_DeleteAddEditMethod
    self.assertEqual(self.ob.fake_skin.test2(),'test2.2')
AttributeError: test2
======================================================================
FAIL: runTest (test_files.FileTestCase)
----------------------------------------------------------------------
Traceback (most recent call last):
  File "test_files.py", line 37, in runTest
  File "/usr/local/lib/python2.1/unittest.py", line 241, in fail
    raise self.failureException, msg
AssertionError: output for /stuff/chrisw/ZopeTests/sandbox/Zope/lib/python/TAL/tests/input/test01.xml didn't match
======================================================================
FAIL: windows INSTANCE_HOME
----------------------------------------------------------------------
Traceback (most recent call last):
  File "/stuff/chrisw/ZopeTests/sandbox/Zope/lib/python/Products/CMFCore/tests/test_DirectoryView.py", line 70, in test_getDirectoryInfo1
    self.failUnless(hasattr(self.ob.fake_skin,'test1'))
  File "/usr/local/lib/python2.1/unittest.py", line 249, in failUnless
    if not expr: raise self.failureException, msg
AssertionError
======================================================================
FAIL: windows SOFTWARE_HOME
----------------------------------------------------------------------
Traceback (most recent call last):
  File "/stuff/chrisw/ZopeTests/sandbox/Zope/lib/python/Products/CMFCore/tests/test_DirectoryView.py", line 76, in test_getDirectoryInfo2
    self.failUnless(hasattr(self.ob.fake_skin,'test1'))
  File "/usr/local/lib/python2.1/unittest.py", line 249, in failUnless
    if not expr: raise self.failureException, msg
AssertionError
======================================================================
FAIL: Test deleting, then adding, then editing a .security file
----------------------------------------------------------------------
Traceback (most recent call last):
  File "/stuff/chrisw/ZopeTests/sandbox/Zope/lib/python/Products/CMFCore/tests/test_FSSecurity.py", line 128, in test_DelAddEditPRM
    self._checkSettings(self.ob.fake_skin.test5,'View',0,['Manager','Anonymous'])
  File "/stuff/chrisw/ZopeTests/sandbox/Zope/lib/python/Products/CMFCore/tests/test_FSSecurity.py", line 33, in _checkSettings
    self.assertEqual((acquire,expected),(acquired,got))
  File "/usr/local/lib/python2.1/unittest.py", line 273, in failUnlessEqual
    raise self.failureException, (msg or '%s != %s' % (first, second))
AssertionError: (0, {'Anonymous': 1, 'Manager': 1}) != (1, {})
======================================================================
FAIL: Test adding of a .security
----------------------------------------------------------------------
Traceback (most recent call last):
  File "/stuff/chrisw/ZopeTests/sandbox/Zope/lib/python/Products/CMFCore/tests/test_FSSecurity.py", line 95, in test_addPRM
    self._checkSettings(self.ob.fake_skin.test5,'View',1,['Manager'])
  File "/stuff/chrisw/ZopeTests/sandbox/Zope/lib/python/Products/CMFCore/tests/test_FSSecurity.py", line 33, in _checkSettings
    self.assertEqual((acquire,expected),(acquired,got))
  File "/usr/local/lib/python2.1/unittest.py", line 273, in failUnlessEqual
    raise self.failureException, (msg or '%s != %s' % (first, second))
AssertionError: (1, {'Manager': 1}) != (1, {})
======================================================================
FAIL: Test deleting of a .security
----------------------------------------------------------------------
Traceback (most recent call last):
  File "/stuff/chrisw/ZopeTests/sandbox/Zope/lib/python/Products/CMFCore/tests/test_FSSecurity.py", line 102, in test_delPRM
    self._checkSettings(self.ob.fake_skin.test5,'View',1,['Manager'])
  File "/stuff/chrisw/ZopeTests/sandbox/Zope/lib/python/Products/CMFCore/tests/test_FSSecurity.py", line 33, in _checkSettings
    self.assertEqual((acquire,expected),(acquired,got))
  File "/usr/local/lib/python2.1/unittest.py", line 273, in failUnlessEqual
    raise self.failureException, (msg or '%s != %s' % (first, second))
AssertionError: (1, {'Manager': 1}) != (1, {})
======================================================================
FAIL: Test editing a .security
----------------------------------------------------------------------
Traceback (most recent call last):
  File "/stuff/chrisw/ZopeTests/sandbox/Zope/lib/python/Products/CMFCore/tests/test_FSSecurity.py", line 112, in test_editPRM
    self._checkSettings(self.ob.fake_skin.test5,'View',0,['Manager','Anonymous'])
  File "/stuff/chrisw/ZopeTests/sandbox/Zope/lib/python/Products/CMFCore/tests/test_FSSecurity.py", line 33, in _checkSettings
    self.assertEqual((acquire,expected),(acquired,got))
  File "/usr/local/lib/python2.1/unittest.py", line 273, in failUnlessEqual
    raise self.failureException, (msg or '%s != %s' % (first, second))
AssertionError: (0, {'Anonymous': 1, 'Manager': 1}) != (1, {})
======================================================================
FAIL: windows INSTANCE_HOME
----------------------------------------------------------------------
Traceback (most recent call last):
  File "/stuff/chrisw/ZopeTests/sandbox/Zope/lib/python/Products/CMFCore/tests/test_DirectoryView.py", line 70, in test_getDirectoryInfo1
    self.failUnless(hasattr(self.ob.fake_skin,'test1'))
  File "/usr/local/lib/python2.1/unittest.py", line 249, in failUnless
    if not expr: raise self.failureException, msg
AssertionError
======================================================================
FAIL: windows SOFTWARE_HOME
----------------------------------------------------------------------
Traceback (most recent call last):
  File "/stuff/chrisw/ZopeTests/sandbox/Zope/lib/python/Products/CMFCore/tests/test_DirectoryView.py", line 76, in test_getDirectoryInfo2
    self.failUnless(hasattr(self.ob.fake_skin,'test1'))
  File "/usr/local/lib/python2.1/unittest.py", line 249, in failUnless
    if not expr: raise self.failureException, msg
AssertionError
======================================================================
FAIL: Test deleting, then adding, then editing a .security file
----------------------------------------------------------------------
Traceback (most recent call last):
  File "/stuff/chrisw/ZopeTests/sandbox/Zope/lib/python/Products/CMFCore/tests/test_FSSecurity.py", line 128, in test_DelAddEditPRM
    self._checkSettings(self.ob.fake_skin.test5,'View',0,['Manager','Anonymous'])
  File "/stuff/chrisw/ZopeTests/sandbox/Zope/lib/python/Products/CMFCore/tests/test_FSSecurity.py", line 33, in _checkSettings
    self.assertEqual((acquire,expected),(acquired,got))
  File "/usr/local/lib/python2.1/unittest.py", line 273, in failUnlessEqual
    raise self.failureException, (msg or '%s != %s' % (first, second))
AssertionError: (0, {'Anonymous': 1, 'Manager': 1}) != (1, {})
======================================================================
FAIL: Test adding of a .security
----------------------------------------------------------------------
Traceback (most recent call last):
  File "/stuff/chrisw/ZopeTests/sandbox/Zope/lib/python/Products/CMFCore/tests/test_FSSecurity.py", line 95, in test_addPRM
    self._checkSettings(self.ob.fake_skin.test5,'View',1,['Manager'])
  File "/stuff/chrisw/ZopeTests/sandbox/Zope/lib/python/Products/CMFCore/tests/test_FSSecurity.py", line 33, in _checkSettings
    self.assertEqual((acquire,expected),(acquired,got))
  File "/usr/local/lib/python2.1/unittest.py", line 273, in failUnlessEqual
    raise self.failureException, (msg or '%s != %s' % (first, second))
AssertionError: 
<truncated>