[Zope-Coders] Win32 Tests - Zope HEAD + CMF HEAD - failures:5

zope-tests@squishdot.org zope-tests@squishdot.org
Fri, 16 Aug 2002 03:10:52 +0100


==============================================================================
==============================================================================
Python Version:2.1.3 (#35, Apr  8 2002, 17:47:50) [MSC 32 bit (Intel)]

Modules included:
Zope (HEAD)
CMF/CMFCore (HEAD)
CMF/CMFCalendar (HEAD)
CMF/CMFDefault (HEAD)
CMF/CMFTopic (HEAD)
CMF/DCWorkflow (HEAD)

======================================================================
FAIL: Test deleting, then adding, then editing a .security file
----------------------------------------------------------------------
Traceback (most recent call last):
  File "test_FSSecurity.py", line 162, in test_DelAddEditPRM
  File "test_FSSecurity.py", line 32, in _checkSettings
  File "C:\python21\lib\unittest.py", line 273, in failUnlessEqual
    raise self.failureException, (msg or '%s != %s' % (first, second))
AssertionError: (1, {'Manager': 1}) != (0, {'Anonymous': 1, 'Manager': 1})
======================================================================
FAIL: Test editing a .security
----------------------------------------------------------------------
Traceback (most recent call last):
  File "test_FSSecurity.py", line 137, in test_editPRM
  File "test_FSSecurity.py", line 32, in _checkSettings
  File "C:\python21\lib\unittest.py", line 273, in failUnlessEqual
    raise self.failureException, (msg or '%s != %s' % (first, second))
AssertionError: (1, {'Manager': 1}) != (0, {'Anonymous': 1, 'Manager': 1})
======================================================================
FAIL: test_DeleteAddEditMethod (Products.CMFCore.tests.test_DirectoryView.DebugModeTests)
----------------------------------------------------------------------
Traceback (most recent call last):
  File "test_DirectoryView.py", line 176, in test_DeleteAddEditMethod
  File "C:\python21\lib\unittest.py", line 273, in failUnlessEqual
    raise self.failureException, (msg or '%s != %s' % (first, second))
AssertionError: test2.2 != test2.3
======================================================================
FAIL: Test deleting, then adding, then editing a .security file
----------------------------------------------------------------------
Traceback (most recent call last):
  File "test_FSSecurity.py", line 162, in test_DelAddEditPRM
  File "test_FSSecurity.py", line 32, in _checkSettings
  File "C:\python21\lib\unittest.py", line 273, in failUnlessEqual
    raise self.failureException, (msg or '%s != %s' % (first, second))
AssertionError: (1, {'Manager': 1}) != (0, {'Anonymous': 1, 'Manager': 1})
======================================================================
FAIL: Test editing a .security
----------------------------------------------------------------------
Traceback (most recent call last):
  File "test_FSSecurity.py", line 137, in test_editPRM
  File "test_FSSecurity.py", line 32, in _checkSettings
  File "C:\python21\lib\unittest.py", line 273, in failUnlessEqual
    raise self.failureException, (msg or '%s != %s' % (first, second))
AssertionError: (1, {'Manager': 1}) != (0, {'Anonymous': 1, 'Manager': 1})
----------------------------------------------------------------------
Ran 2138 tests in 199.953s

FAILED (failures=5)

======================================================================
OVERALL FAILED (total failures=5)