[Zope-Coders] Win32 Tests - Zope 2.5 branch - failures:1 errors:3
zope-tests@squishdot.org
zope-tests@squishdot.org
Thu, 22 Aug 2002 03:10:54 +0100
==============================================================================
==============================================================================
Python Version:2.1.3 (#35, Apr 8 2002, 17:47:50) [MSC 32 bit (Intel)]
Modules included:
Zope (Zope-2_5-branch)
======================================================================
ERROR: testPasteMultiNotSameID (testCopySupport.TestCopySupport)
----------------------------------------------------------------------
Traceback (most recent call last):
File "testCopySupport.py", line 170, in testPasteMultiNotSameID
File "D:\ZopeTests\sandbox\Zope\lib\python\OFS\CopySupport.py", line 158, in manage_pasteObjects
ob=ob._getCopy(self)
File "D:\ZopeTests\sandbox\Zope\lib\python\OFS\CopySupport.py", line 403, in _getCopy
ob=container._p_jar.importFile(f)
File "D:\ZopeTests\sandbox\Zope\lib\python\ZODB\ExportImport.py", line 79, in importFile
t.commit(1)
File "D:\ZopeTests\sandbox\Zope\lib\python\ZODB\Transaction.py", line 234, in commit
j.commit(o,self)
File "D:\ZopeTests\sandbox\Zope\lib\python\ZODB\Connection.py", line 346, in commit
dump(state)
UnpickleableError: Cannot pickle <type 'Python Method'> objects
======================================================================
ERROR: testPasteMultiSameID (testCopySupport.TestCopySupport)
----------------------------------------------------------------------
Traceback (most recent call last):
File "testCopySupport.py", line 199, in testPasteMultiSameID
File "D:\ZopeTests\sandbox\Zope\lib\python\OFS\CopySupport.py", line 158, in manage_pasteObjects
ob=ob._getCopy(self)
File "D:\ZopeTests\sandbox\Zope\lib\python\OFS\CopySupport.py", line 403, in _getCopy
ob=container._p_jar.importFile(f)
File "D:\ZopeTests\sandbox\Zope\lib\python\ZODB\ExportImport.py", line 79, in importFile
t.commit(1)
File "D:\ZopeTests\sandbox\Zope\lib\python\ZODB\Transaction.py", line 234, in commit
j.commit(o,self)
File "D:\ZopeTests\sandbox\Zope\lib\python\ZODB\Connection.py", line 346, in commit
dump(state)
UnpickleableError: Cannot pickle <type 'Python Method'> objects
======================================================================
ERROR: testPasteSingleSameID (testCopySupport.TestCopySupport)
----------------------------------------------------------------------
Traceback (most recent call last):
File "testCopySupport.py", line 152, in testPasteSingleSameID
File "D:\ZopeTests\sandbox\Zope\lib\python\OFS\CopySupport.py", line 158, in manage_pasteObjects
ob=ob._getCopy(self)
File "D:\ZopeTests\sandbox\Zope\lib\python\OFS\CopySupport.py", line 403, in _getCopy
ob=container._p_jar.importFile(f)
File "D:\ZopeTests\sandbox\Zope\lib\python\ZODB\ExportImport.py", line 79, in importFile
t.commit(1)
File "D:\ZopeTests\sandbox\Zope\lib\python\ZODB\Transaction.py", line 234, in commit
j.commit(o,self)
File "D:\ZopeTests\sandbox\Zope\lib\python\ZODB\Connection.py", line 346, in commit
dump(state)
UnpickleableError: Cannot pickle <type 'Python Method'> objects
======================================================================
FAIL: checkTransactionalUndoAfterPack (testFileStorage.FileStorageTests)
----------------------------------------------------------------------
Traceback (most recent call last):
File "D:\ZopeTests\sandbox\Zope\lib\python\ZODB\tests\TransactionalUndoStorage.py", line 448, in checkTransactionalUndoAfterPack
eq(len(info2), 2)
File "C:\python21\lib\unittest.py", line 273, in failUnlessEqual
raise self.failureException, (msg or '%s != %s' % (first, second))
AssertionError: 3 != 2
----------------------------------------------------------------------
Ran 1193 tests in 146.000s
FAILED (failures=1, errors=3)
======================================================================
OVERALL FAILED (total failures=1, total errors=3)