[Zope-Coders] Win32 Tests - Zope 2.5 branch - failures:2 errors:9
zope-tests@squishdot.org
zope-tests@squishdot.org
Fri, 23 Aug 2002 03:10:51 +0100
==============================================================================
==============================================================================
Python Version:2.1.3 (#35, Apr 8 2002, 17:47:50) [MSC 32 bit (Intel)]
Modules included:
Zope (Zope-2_5-branch)
======================================================================
ERROR: testPasteMultiNotSameID (testCopySupport.TestCopySupport)
----------------------------------------------------------------------
Traceback (most recent call last):
File "testCopySupport.py", line 170, in testPasteMultiNotSameID
File "D:\ZopeTests\sandbox\Zope\lib\python\OFS\CopySupport.py", line 158, in manage_pasteObjects
ob=ob._getCopy(self)
File "D:\ZopeTests\sandbox\Zope\lib\python\OFS\CopySupport.py", line 403, in _getCopy
ob=container._p_jar.importFile(f)
File "D:\ZopeTests\sandbox\Zope\lib\python\ZODB\ExportImport.py", line 79, in importFile
t.commit(1)
File "D:\ZopeTests\sandbox\Zope\lib\python\ZODB\Transaction.py", line 234, in commit
j.commit(o,self)
File "D:\ZopeTests\sandbox\Zope\lib\python\ZODB\Connection.py", line 346, in commit
dump(state)
UnpickleableError: Cannot pickle <type 'Python Method'> objects
======================================================================
ERROR: testPasteMultiSameID (testCopySupport.TestCopySupport)
----------------------------------------------------------------------
Traceback (most recent call last):
File "testCopySupport.py", line 199, in testPasteMultiSameID
File "D:\ZopeTests\sandbox\Zope\lib\python\OFS\CopySupport.py", line 158, in manage_pasteObjects
ob=ob._getCopy(self)
File "D:\ZopeTests\sandbox\Zope\lib\python\OFS\CopySupport.py", line 403, in _getCopy
ob=container._p_jar.importFile(f)
File "D:\ZopeTests\sandbox\Zope\lib\python\ZODB\ExportImport.py", line 79, in importFile
t.commit(1)
File "D:\ZopeTests\sandbox\Zope\lib\python\ZODB\Transaction.py", line 234, in commit
j.commit(o,self)
File "D:\ZopeTests\sandbox\Zope\lib\python\ZODB\Connection.py", line 346, in commit
dump(state)
UnpickleableError: Cannot pickle <type 'Python Method'> objects
======================================================================
ERROR: testPasteSingleSameID (testCopySupport.TestCopySupport)
----------------------------------------------------------------------
Traceback (most recent call last):
File "testCopySupport.py", line 152, in testPasteSingleSameID
File "D:\ZopeTests\sandbox\Zope\lib\python\OFS\CopySupport.py", line 158, in manage_pasteObjects
ob=ob._getCopy(self)
File "D:\ZopeTests\sandbox\Zope\lib\python\OFS\CopySupport.py", line 403, in _getCopy
ob=container._p_jar.importFile(f)
File "D:\ZopeTests\sandbox\Zope\lib\python\ZODB\ExportImport.py", line 79, in importFile
t.commit(1)
File "D:\ZopeTests\sandbox\Zope\lib\python\ZODB\Transaction.py", line 234, in commit
j.commit(o,self)
File "D:\ZopeTests\sandbox\Zope\lib\python\ZODB\Connection.py", line 346, in commit
dump(state)
UnpickleableError: Cannot pickle <type 'Python Method'> objects
======================================================================
ERROR: Check a quoted query
----------------------------------------------------------------------
Traceback (most recent call last):
File "testTextIndex.py", line 196, in checkQuotesQuery
File "testTextIndex.py", line 157, in globTest
File "testTextIndex.py", line 51, in dbopen
File "D:\ZopeTests\sandbox\Zope\lib\python\ZODB\FileStorage.py", line 213, in __init__
lock_file(f)
File "D:\ZopeTests\sandbox\Zope\lib\python\ZODB\lock_file.py", line 51, in lock_file
raise error, (
StorageSystemError: Could not lock the database file. There must be
another process that has opened the file.
<p>
======================================================================
ERROR: Check a quoted query (unicode)
----------------------------------------------------------------------
Traceback (most recent call last):
File "testTextIndex.py", line 249, in checkQuotesQueryUnicode
File "testTextIndex.py", line 157, in globTest
File "testTextIndex.py", line 51, in dbopen
File "D:\ZopeTests\sandbox\Zope\lib\python\ZODB\FileStorage.py", line 213, in __init__
lock_file(f)
File "D:\ZopeTests\sandbox\Zope\lib\python\ZODB\lock_file.py", line 51, in lock_file
raise error, (
StorageSystemError: Could not lock the database file. There must be
another process that has opened the file.
<p>
======================================================================
ERROR: Check a star query
----------------------------------------------------------------------
Traceback (most recent call last):
File "testTextIndex.py", line 175, in checkStarQuery
File "testTextIndex.py", line 157, in globTest
File "testTextIndex.py", line 51, in dbopen
File "D:\ZopeTests\sandbox\Zope\lib\python\ZODB\FileStorage.py", line 213, in __init__
lock_file(f)
File "D:\ZopeTests\sandbox\Zope\lib\python\ZODB\lock_file.py", line 51, in lock_file
raise error, (
StorageSystemError: Could not lock the database file. There must be
another process that has opened the file.
<p>
======================================================================
ERROR: Check a star query (unicode)
----------------------------------------------------------------------
Traceback (most recent call last):
File "testTextIndex.py", line 228, in checkStarQueryUnicode
File "testTextIndex.py", line 157, in globTest
File "testTextIndex.py", line 51, in dbopen
File "D:\ZopeTests\sandbox\Zope\lib\python\ZODB\FileStorage.py", line 213, in __init__
lock_file(f)
File "D:\ZopeTests\sandbox\Zope\lib\python\ZODB\lock_file.py", line 51, in lock_file
raise error, (
StorageSystemError: Could not lock the database file. There must be
another process that has opened the file.
<p>
======================================================================
ERROR: Check a query with 'operator' in the request
----------------------------------------------------------------------
Traceback (most recent call last):
File "testTextIndex.py", line 214, in checkTextIndexOperatorQuery
File "testTextIndex.py", line 157, in globTest
File "testTextIndex.py", line 51, in dbopen
File "D:\ZopeTests\sandbox\Zope\lib\python\ZODB\FileStorage.py", line 213, in __init__
lock_file(f)
File "D:\ZopeTests\sandbox\Zope\lib\python\ZODB\lock_file.py", line 51, in lock_file
raise error, (
StorageSystemError: Could not lock the database file. There must be
another process that has opened the file.
<p>
======================================================================
ERROR: Check a query with 'operator' in the request (unicode)
----------------------------------------------------------------------
Traceback (most recent call last):
File "testTextIndex.py", line 267, in checkTextIndexOperatorQueryUnicode
File "testTextIndex.py", line 157, in globTest
File "testTextIndex.py", line 51, in dbopen
File "D:\ZopeTests\sandbox\Zope\lib\python\ZODB\FileStorage.py", line 213, in __init__
lock_file(f)
File "D:\ZopeTests\sandbox\Zope\lib\python\ZODB\lock_file.py", line 51, in lock_file
raise error, (
StorageSystemError: Could not lock the database file. There must be
another process that has opened the file.
<p>
======================================================================
FAIL: Check less simple persistent indexing
----------------------------------------------------------------------
Traceback (most recent call last):
File "testTextIndex.py", line 128, in checkPersistentUpdate2
File "testTextIndex.py", line 51, in dbopen
File "D:\ZopeTests\sandbox\Zope\lib\python\ZODB\FileStorage.py", line 262, in __init__
warn("%s Database records in the future", file_name);
File "D:\ZopeTests\sandbox\Zope\lib\python\ZODB\FileStorage.py", line 151, in warn
LOG('ZODB FS',WARNING, "%s warn: %s\n" % (packed_version, (message % data)))
File "D:\ZopeTests\sandbox\Zope\lib\python\zLOG\__init__.py", line 130, in LOG
log_write(subsystem, severity, summary, detail, error)
File "testTextIndex.py", line 20, in log_write
AssertionError: ZODB FS(100): FS21 warn: fs_tmp__904 Database records in the future
======================================================================
FAIL: checkTransactionalUndoAfterPack (testFileStorage.FileStorageTests)
----------------------------------------------------------------------
Traceback (most recent call last):
File "D:\ZopeTests\sandbox\Zope\lib\python\ZODB\tests\TransactionalUndoStorage.py", line 448, in checkTransactionalUndoAfterPack
eq(len(info2), 2)
File "C:\python21\lib\unittest.py", line 273, in failUnlessEqual
raise self.failureException, (msg or '%s != %s' % (first, second))
AssertionError: 3 != 2
----------------------------------------------------------------------
Ran 1193 tests in 145.547s
FAILED (failures=2, errors=9)
======================================================================
OVERALL FAILED (total failures=2, total errors=9)