[Zope-Coders] Linux Test Results - Zope 2.5 branch - failures:1 errors:3
zope-tests@squishdot.org
zope-tests@squishdot.org
Mon, 26 Aug 2002 03:00:01 +0100
==============================================================================
==============================================================================
Python Version:2.1.3 (#1, May 20 2002, 12:02:16)
[GCC 2.95.2 20000220 (Debian GNU/Linux)]
Modules included:
Zope (Zope-2_5-branch)
Traceback (most recent call last):
File "/stuff/chrisw/ZopeTests/sandbox/Zope/lib/python/TAL/runtest.py", line 92, in main
driver.main()
File "/stuff/chrisw/ZopeTests/sandbox/Zope/lib/python/TAL/driver.py", line 77, in main
it = compilefile(file, mode)
File "/stuff/chrisw/ZopeTests/sandbox/Zope/lib/python/TAL/driver.py", line 106, in compilefile
p.parseFile(file)
File "/stuff/chrisw/ZopeTests/sandbox/Zope/lib/python/TAL/XMLParser.py", line 76, in parseFile
self.parseStream(open(filename))
File "/stuff/chrisw/ZopeTests/sandbox/Zope/lib/python/TAL/XMLParser.py", line 86, in parseStream
self.parser.ParseFile(stream)
ExpatError: undefined entity: line 18, column 2
======================================================================
ERROR: testPasteMultiNotSameID (testCopySupport.TestCopySupport)
----------------------------------------------------------------------
Traceback (most recent call last):
File "testCopySupport.py", line 170, in testPasteMultiNotSameID
File "/stuff/chrisw/ZopeTests/sandbox/Zope/lib/python/OFS/CopySupport.py", line 158, in manage_pasteObjects
ob=ob._getCopy(self)
File "/stuff/chrisw/ZopeTests/sandbox/Zope/lib/python/OFS/CopySupport.py", line 403, in _getCopy
ob=container._p_jar.importFile(f)
File "/stuff/chrisw/ZopeTests/sandbox/Zope/lib/python/ZODB/ExportImport.py", line 79, in importFile
t.commit(1)
File "/stuff/chrisw/ZopeTests/sandbox/Zope/lib/python/ZODB/Transaction.py", line 234, in commit
j.commit(o,self)
File "/stuff/chrisw/ZopeTests/sandbox/Zope/lib/python/ZODB/Connection.py", line 346, in commit
dump(state)
UnpickleableError: Cannot pickle <type 'Python Method'> objects
======================================================================
ERROR: testPasteMultiSameID (testCopySupport.TestCopySupport)
----------------------------------------------------------------------
Traceback (most recent call last):
File "testCopySupport.py", line 199, in testPasteMultiSameID
File "/stuff/chrisw/ZopeTests/sandbox/Zope/lib/python/OFS/CopySupport.py", line 158, in manage_pasteObjects
ob=ob._getCopy(self)
File "/stuff/chrisw/ZopeTests/sandbox/Zope/lib/python/OFS/CopySupport.py", line 403, in _getCopy
ob=container._p_jar.importFile(f)
File "/stuff/chrisw/ZopeTests/sandbox/Zope/lib/python/ZODB/ExportImport.py", line 79, in importFile
t.commit(1)
File "/stuff/chrisw/ZopeTests/sandbox/Zope/lib/python/ZODB/Transaction.py", line 234, in commit
j.commit(o,self)
File "/stuff/chrisw/ZopeTests/sandbox/Zope/lib/python/ZODB/Connection.py", line 346, in commit
dump(state)
UnpickleableError: Cannot pickle <type 'Python Method'> objects
======================================================================
ERROR: testPasteSingleSameID (testCopySupport.TestCopySupport)
----------------------------------------------------------------------
Traceback (most recent call last):
File "testCopySupport.py", line 152, in testPasteSingleSameID
File "/stuff/chrisw/ZopeTests/sandbox/Zope/lib/python/OFS/CopySupport.py", line 158, in manage_pasteObjects
ob=ob._getCopy(self)
File "/stuff/chrisw/ZopeTests/sandbox/Zope/lib/python/OFS/CopySupport.py", line 403, in _getCopy
ob=container._p_jar.importFile(f)
File "/stuff/chrisw/ZopeTests/sandbox/Zope/lib/python/ZODB/ExportImport.py", line 79, in importFile
t.commit(1)
File "/stuff/chrisw/ZopeTests/sandbox/Zope/lib/python/ZODB/Transaction.py", line 234, in commit
j.commit(o,self)
File "/stuff/chrisw/ZopeTests/sandbox/Zope/lib/python/ZODB/Connection.py", line 346, in commit
dump(state)
UnpickleableError: Cannot pickle <type 'Python Method'> objects
======================================================================
FAIL: runTest (test_files.FileTestCase)
----------------------------------------------------------------------
Traceback (most recent call last):
File "test_files.py", line 37, in runTest
File "/usr/local/lib/python2.1/unittest.py", line 241, in fail
raise self.failureException, msg
AssertionError: output for /stuff/chrisw/ZopeTests/sandbox/Zope/lib/python/TAL/tests/input/test01.xml didn't match
----------------------------------------------------------------------
Ran 1192 tests in 249.676s
FAILED (failures=1, errors=3)
======================================================================
OVERALL FAILED (total failures=1, total errors=3)