[Zope-Coders] [Fwd: Win32 Zope Test Results]
Chris Withers
chrisw@nipltd.com
Mon, 04 Feb 2002 08:38:06 +0000
Hi Guys,
Unless someone tells me not to, I'm gonna start sending the results of my
nightly test runner for Win32 to this list.
Here's the results of last nights run...
cheeers,
Chris
PS: If anyone wants to see any other scenarios tested, just let me know :-)
chrisw@nipltd.com wrote:
>
> ================================================================================
> ================================================================================
> Python Version:2.1 (#15, Apr 16 2001, 18:25:49) [MSC 32 bit (Intel)]
>
> Modules included:
> Zope (HEAD)
> CMF/CMFCore (HEAD)
> CMF/CMFCalendar (HEAD)
> CMF/CMFCollector (HEAD)
> CMF/CMFDecor (HEAD)
> CMF/CMFDefault (HEAD)
> CMF/CMFTopic (HEAD)
> CMF/CMFTracker (HEAD)
> CMF/CMFWiki (HEAD)
> CMF/DCWorkflow (HEAD)
>
> ======================================================================
> FAIL: testBatchingEtc (testSecurity.SecurityTests)
> ----------------------------------------------------------------------
> Traceback (most recent call last):
> File "E:\ZopeTests\Zope\lib\python\DocumentTemplate\tests\testDTML.py", line 166, in testBatchingEtc
> assert res == expected, res
> AssertionError: <html><head><title>Inventory by Dealer</title></head><body>
> <dl>
>
> (Bay Chevy 96 Chevrolet Caprice - Bay Chevy 96 Chevrolet Nova)
>
> (Bay Chevy 96 Chevrolet Corvett - Bay Chevy 96 Chevrolet Corsica)
>
> (Bay Chevy 96 Chevrolet Corsica - Colman Olds 96 Olds Ciera)
>
> <dt>Colman Olds</dt><dd>
>
> 96 Olds Cutlass <p>
>
> 95 Olds Cutlas <p>
>
> 93 Dodge Shadow <p>
>
> 94 Jeep Cheroke <p>
>
> 92 Toyota Previa <p>
>
> </dd>
>
> (Colman Olds 93 Toyota Celica - Colman Olds 94 Honda Civic)
>
> (Colman Olds 93 Honda Civix - Spam Chev 96 Chevrolet Nova)
>
> (Spam Chev 96 Chevrolet Corvett - Spam Chev 96 Chevrolet Corsica)
>
> (Spam Chev 96 Chevrolet Corsica - Spam Olds 96 Olds Ciera)
>
> (Spam Olds 96 Olds Cutlass - Spam Olds 92 Toyota Previa)
>
> (Spam Olds 93 Toyota Celica - Spam Olds 93 Honda Civix)
>
> </dl>
> </body></html>
>
> ======================================================================
> FAIL: testBatchingEtc (testUserFolder.SecurityTests)
> ----------------------------------------------------------------------
> Traceback (most recent call last):
> File "E:\ZopeTests\Zope\lib\python\DocumentTemplate\tests\testDTML.py", line 166, in testBatchingEtc
> assert res == expected, res
> AssertionError: <html><head><title>Inventory by Dealer</title></head><body>
> <dl>
>
> (Bay Chevy 96 Chevrolet Caprice - Bay Chevy 96 Chevrolet Nova)
>
> (Bay Chevy 96 Chevrolet Corvett - Bay Chevy 96 Chevrolet Corsica)
>
> (Bay Chevy 96 Chevrolet Corsica - Colman Olds 96 Olds Ciera)
>
> <dt>Colman Olds</dt><dd>
>
> 96 Olds Cutlass <p>
>
> 95 Olds Cutlas <p>
>
> 93 Dodge Shadow <p>
>
> 94 Jeep Cheroke <p>
>
> 92 Toyota Previa <p>
>
> </dd>
>
> (Colman Olds 93 Toyota Celica - Colman Olds 94 Honda Civic)
>
> (Colman Olds 93 Honda Civix - Spam Chev 96 Chevrolet Nova)
>
> (Spam Chev 96 Chevrolet Corvett - Spam Chev 96 Chevrolet Corsica)
>
> (Spam Chev 96 Chevrolet Corsica - Spam Olds 96 Olds Ciera)
>
> (Spam Olds 96 Olds Cutlass - Spam Olds 92 Toyota Previa)
>
> (Spam Olds 93 Toyota Celica - Spam Olds 93 Honda Civix)
>
> </dl>
> </body></html>
>
> ======================================================================
> FAIL: Constructor from date/time string
> ----------------------------------------------------------------------
> Traceback (most recent call last):
> File "testDateTime.py", line 57, in testConstructor3
> File "testDateTime.py", line 14, in _compare
> AssertionError: 1012788369165 != 1012788369164
> ======================================================================
> FAIL: Constructor from parts
> ----------------------------------------------------------------------
> Traceback (most recent call last):
> File "testDateTime.py", line 90, in testConstructor7
> AssertionError: (DateTime('2002/02/04 02:06:09.175 GMT+0'), DateTime('2002/02/04 02:06:09.175 GMT+0'))
> ======================================================================
> FAIL: testBatchingEtc (testDTML.DTMLTests)
> ----------------------------------------------------------------------
> Traceback (most recent call last):
> File "E:\ZopeTests\Zope\lib\python\DocumentTemplate\tests\testDTML.py", line 166, in testBatchingEtc
> assert res == expected, res
> AssertionError: <html><head><title>Inventory by Dealer</title></head><body>
> <dl>
>
> (Bay Chevy 96 Chevrolet Caprice - Bay Chevy 96 Chevrolet Nova)
>
> (Bay Chevy 96 Chevrolet Corvett - Bay Chevy 96 Chevrolet Corsica)
>
> (Bay Chevy 96 Chevrolet Corsica - Colman Olds 96 Olds Ciera)
>
> <dt>Colman Olds</dt><dd>
>
> 96 Olds Cutlass <p>
>
> 95 Olds Cutlas <p>
>
> 93 Dodge Shadow <p>
>
> 94 Jeep Cheroke <p>
>
> 92 Toyota Previa <p>
>
> </dd>
>
> (Colman Olds 93 Toyota Celica - Colman Olds 94 Honda Civic)
>
> (Colman Olds 93 Honda Civix - Spam Chev 96 Chevrolet Nova)
>
> (Spam Chev 96 Chevrolet Corvett - Spam Chev 96 Chevrolet Corsica)
>
> (Spam Chev 96 Chevrolet Corsica - Spam Olds 96 Olds Ciera)
>
> (Spam Olds 96 Olds Cutlass - Spam Olds 92 Toyota Previa)
>
> (Spam Olds 93 Toyota Celica - Spam Olds 93 Honda Civix)
>
> </dl>
> </body></html>
>
> ======================================================================
> FAIL: check_simple_html (test_xmlparser.XMLParserTestCase)
> ----------------------------------------------------------------------
> Traceback (most recent call last):
> File "test_xmlparser.py", line 114, in check_simple_html
> File "test_xmlparser.py", line 95, in _run_check
> File "c:\python21\lib\unittest.py", line 249, in failUnless
> if not expr: raise self.failureException, msg
> AssertionError: [('starttag', u'html', []), ('data', u' \n'), ('comment', u'comment1a\n-></foo><bar><<?pi?></foo<bar\ncomment1b'), ('data', u'\n'), ('starttag', u'img', [u'src', u'Bar', u'ismap', u'']), ('endtag', u'img'), ('data', u'sample\ntext\n'), ('comment', u'comment2a- -comment2b'), ('data', u'\n'), ('endtag', u'html')]
> ----------------------------------------------------------------------
> Ran 1471 tests in 214.669s
>
> FAILED (failures=6)
>
> ======================================================================
> OVERALL FAILED (total failures=6)
>
> ================================================================================
> ================================================================================
> ================================================================================
> ================================================================================
> Python Version:2.1 (#15, Apr 16 2001, 18:25:49) [MSC 32 bit (Intel)]
>
> Modules included:
> Zope (Zope-2_5-branch)
> CMF/CMFCore (HEAD)
> CMF/CMFCalendar (HEAD)
> CMF/CMFCollector (HEAD)
> CMF/CMFDecor (HEAD)
> CMF/CMFDefault (HEAD)
> CMF/CMFTopic (HEAD)
> CMF/CMFTracker (HEAD)
> CMF/CMFWiki (HEAD)
> CMF/DCWorkflow (HEAD)
>
> ======================================================================
> FAIL: testBatchingEtc (testSecurity.SecurityTests)
> ----------------------------------------------------------------------
> Traceback (most recent call last):
> File "E:\ZopeTests\Zope\lib\python\DocumentTemplate\tests\testDTML.py", line 166, in testBatchingEtc
> assert res == expected, res
> AssertionError: <html><head><title>Inventory by Dealer</title></head><body>
> <dl>
>
> (Bay Chevy 96 Chevrolet Caprice - Bay Chevy 96 Chevrolet Nova)
>
> (Bay Chevy 96 Chevrolet Corvett - Bay Chevy 96 Chevrolet Corsica)
>
> (Bay Chevy 96 Chevrolet Corsica - Colman Olds 96 Olds Ciera)
>
> <dt>Colman Olds</dt><dd>
>
> 96 Olds Cutlass <p>
>
> 95 Olds Cutlas <p>
>
> 93 Dodge Shadow <p>
>
> 94 Jeep Cheroke <p>
>
> 92 Toyota Previa <p>
>
> </dd>
>
> (Colman Olds 93 Toyota Celica - Colman Olds 94 Honda Civic)
>
> (Colman Olds 93 Honda Civix - Spam Chev 96 Chevrolet Nova)
>
> (Spam Chev 96 Chevrolet Corvett - Spam Chev 96 Chevrolet Corsica)
>
> (Spam Chev 96 Chevrolet Corsica - Spam Olds 96 Olds Ciera)
>
> (Spam Olds 96 Olds Cutlass - Spam Olds 92 Toyota Previa)
>
> (Spam Olds 93 Toyota Celica - Spam Olds 93 Honda Civix)
>
> </dl>
> </body></html>
>
> ======================================================================
> FAIL: testBatchingEtc (testUserFolder.SecurityTests)
> ----------------------------------------------------------------------
> Traceback (most recent call last):
> File "E:\ZopeTests\Zope\lib\python\DocumentTemplate\tests\testDTML.py", line 166, in testBatchingEtc
> assert res == expected, res
> AssertionError: <html><head><title>Inventory by Dealer</title></head><body>
> <dl>
>
> (Bay Chevy 96 Chevrolet Caprice - Bay Chevy 96 Chevrolet Nova)
>
> (Bay Chevy 96 Chevrolet Corvett - Bay Chevy 96 Chevrolet Corsica)
>
> (Bay Chevy 96 Chevrolet Corsica - Colman Olds 96 Olds Ciera)
>
> <dt>Colman Olds</dt><dd>
>
> 96 Olds Cutlass <p>
>
> 95 Olds Cutlas <p>
>
> 93 Dodge Shadow <p>
>
> 94 Jeep Cheroke <p>
>
> 92 Toyota Previa <p>
>
> </dd>
>
> (Colman Olds 93 Toyota Celica - Colman Olds 94 Honda Civic)
>
> (Colman Olds 93 Honda Civix - Spam Chev 96 Chevrolet Nova)
>
> (Spam Chev 96 Chevrolet Corvett - Spam Chev 96 Chevrolet Corsica)
>
> (Spam Chev 96 Chevrolet Corsica - Spam Olds 96 Olds Ciera)
>
> (Spam Olds 96 Olds Cutlass - Spam Olds 92 Toyota Previa)
>
> (Spam Olds 93 Toyota Celica - Spam Olds 93 Honda Civix)
>
> </dl>
> </body></html>
>
> ======================================================================
> FAIL: testBatchingEtc (testDTML.DTMLTests)
> ----------------------------------------------------------------------
> Traceback (most recent call last):
> File "E:\ZopeTests\Zope\lib\python\DocumentTemplate\tests\testDTML.py", line 166, in testBatchingEtc
> assert res == expected, res
> AssertionError: <html><head><title>Inventory by Dealer</title></head><body>
> <dl>
>
> (Bay Chevy 96 Chevrolet Caprice - Bay Chevy 96 Chevrolet Nova)
>
> (Bay Chevy 96 Chevrolet Corvett - Bay Chevy 96 Chevrolet Corsica)
>
> (Bay Chevy 96 Chevrolet Corsica - Colman Olds 96 Olds Ciera)
>
> <dt>Colman Olds</dt><dd>
>
> 96 Olds Cutlass <p>
>
> 95 Olds Cutlas <p>
>
> 93 Dodge Shadow <p>
>
> 94 Jeep Cheroke <p>
>
> 92 Toyota Previa <p>
>
> </dd>
>
> (Colman Olds 93 Toyota Celica - Colman Olds 94 Honda Civic)
>
> (Colman Olds 93 Honda Civix - Spam Chev 96 Chevrolet Nova)
>
> (Spam Chev 96 Chevrolet Corvett - Spam Chev 96 Chevrolet Corsica)
>
> (Spam Chev 96 Chevrolet Corsica - Spam Olds 96 Olds Ciera)
>
> (Spam Olds 96 Olds Cutlass - Spam Olds 92 Toyota Previa)
>
> (Spam Olds 93 Toyota Celica - Spam Olds 93 Honda Civix)
>
> </dl>
> </body></html>
>
> ======================================================================
> FAIL: check_simple_html (test_xmlparser.XMLParserTestCase)
> ----------------------------------------------------------------------
> Traceback (most recent call last):
> File "test_xmlparser.py", line 114, in check_simple_html
> File "test_xmlparser.py", line 95, in _run_check
> File "c:\python21\lib\unittest.py", line 249, in failUnless
> if not expr: raise self.failureException, msg
> AssertionError: [('starttag', u'html', []), ('data', u' \n'), ('comment', u'comment1a\n-></foo><bar><<?pi?></foo<bar\ncomment1b'), ('data', u'\n'), ('starttag', u'img', [u'src', u'Bar', u'ismap', u'']), ('endtag', u'img'), ('data', u'sample\ntext\n'), ('comment', u'comment2a- -comment2b'), ('data', u'\n'), ('endtag', u'html')]
> ----------------------------------------------------------------------
> Ran 1441 tests in 200.929s
>
> FAILED (failures=4)
>
> ======================================================================
> OVERALL FAILED (total failures=4)
>
> ================================================================================
> ================================================================================