[Zope-Coders] Win32 Zope Test Results
zope-coders@zope.org
zope-coders@zope.org
Thu, 21 Feb 2002 02:11:19 +0000
================================================================================
================================================================================
Python Version:2.1.2 (#31, Jan 15 2002, 17:28:11) [MSC 32 bit (Intel)]
Modules included:
Zope (HEAD)
CMF/CMFCore (HEAD)
CMF/CMFCalendar (HEAD)
CMF/CMFCollector (HEAD)
CMF/CMFDecor (HEAD)
CMF/CMFDefault (HEAD)
CMF/CMFTopic (HEAD)
CMF/CMFTracker (HEAD)
CMF/CMFWiki (HEAD)
CMF/DCWorkflow (HEAD)
Module testBTrees.py failed to load
exceptions.ImportError: No module named _OOBTree
File "Utilities\testrunner.py", line 60, in getSuiteFromFile
File "testBTrees.py", line 17, in ?
from BTrees.OOBTree import OOBTree, OOBucket, OOSet, OOTreeSet
File "E:\ZopeTests\Zope\lib\python\BTrees\OOBTree.py", line 16, in ?
from _OOBTree import *
Module testBTreesUnicode.py failed to load
exceptions.ImportError: cannot import name OOBTree
File "Utilities\testrunner.py", line 60, in getSuiteFromFile
File "testBTreesUnicode.py", line 18, in ?
from BTrees.OOBTree import OOBTree
Module testConflict.py failed to load
exceptions.ImportError: cannot import name OOBTree
File "Utilities\testrunner.py", line 60, in getSuiteFromFile
File "testConflict.py", line 16, in ?
from BTrees.OOBTree import OOBTree, OOBucket, OOSet, OOTreeSet
Module testCopySupport.py failed to load
exceptions.ImportError: No module named _IIBTree
File "Utilities\testrunner.py", line 60, in getSuiteFromFile
File "testCopySupport.py", line 5, in ?
from OFS.Application import Application
File "E:\ZopeTests\Zope\lib\python\OFS\Application.py", line 18, in ?
import Globals,Folder,os,sys,App.Product, App.ProductRegistry, misc_
File "E:\ZopeTests\Zope\lib\python\App\Product.py", line 46, in ?
from HelpSys.HelpSys import ProductHelp
File "E:\ZopeTests\Zope\lib\python\HelpSys\__init__.py", line 15, in ?
import HelpSys
File "E:\ZopeTests\Zope\lib\python\HelpSys\HelpSys.py", line 18, in ?
from Products.ZCatalog.ZCatalog import ZCatalog
File "E:\ZopeTests\Zope\lib\python\Products\ZCatalog\__init__.py", line 16, in ?
import ZCatalog, Catalog, CatalogAwareness, ZClasses
File "E:\ZopeTests\Zope\lib\python\Products\ZCatalog\ZCatalog.py", line 27, in ?
from Catalog import Catalog, CatalogError
File "E:\ZopeTests\Zope\lib\python\Products\ZCatalog\Catalog.py", line 17, in ?
from Products.PluginIndexes.TextIndex.Lexicon import Lexicon
File "E:\ZopeTests\Zope\lib\python\Products\PluginIndexes\__init__.py", line 15, in ?
import common.ResultList as ResultList
File "E:\ZopeTests\Zope\lib\python\Products\PluginIndexes\common\ResultList.py", line 14, in ?
from BTrees.IIBTree import IIBucket
File "E:\ZopeTests\Zope\lib\python\BTrees\IIBTree.py", line 16, in ?
from _IIBTree import *
Module testRanges.py failed to load
exceptions.ImportError: cannot import name Application
File "Utilities\testrunner.py", line 60, in getSuiteFromFile
File "testRanges.py", line 17, in ?
from OFS.Application import Application
Module test_all.py failed to load
exceptions.AttributeError: 'OFS' module has no attribute 'Application'
File "Utilities\testrunner.py", line 60, in getSuiteFromFile
File "test_all.py", line 1, in ?
import Zope
File "E:\ZopeTests\Zope\lib\python\Zope\__init__.py", line 29, in ?
OFS.Application.import_products()
Module test_Event.py failed to load
exceptions.ImportError: cannot import name ZCatalog
File "Utilities\testrunner.py", line 60, in getSuiteFromFile
File "test_Event.py", line 3, in ?
from Products.CMFCalendar.Event import Event
File "E:\ZopeTests\Zope\lib\python\Products\CMFCalendar\__init__.py", line 13, in ?
from Products.CMFDefault import Portal
File "E:\ZopeTests\Zope\lib\python\Products\CMFDefault\__init__.py", line 18, in ?
import Portal
File "E:\ZopeTests\Zope\lib\python\Products\CMFDefault\Portal.py", line 20, in ?
from Products.CMFCore.PortalObject import PortalObjectBase
File "E:\ZopeTests\Zope\lib\python\Products\CMFCore\__init__.py", line 17, in ?
import MembershipTool, WorkflowTool, CatalogTool, DiscussionTool
File "E:\ZopeTests\Zope\lib\python\Products\CMFCore\CatalogTool.py", line 23, in ?
from Products.ZCatalog.ZCatalog import ZCatalog
Module test_ActionsTool.py failed to load
exceptions.AttributeError: 'Products' module has no attribute 'CMFCore'
File "Utilities\testrunner.py", line 60, in getSuiteFromFile
File "test_ActionsTool.py", line 12, in ?
from Products.CMFDefault.MembershipTool import MembershipTool
File "E:\ZopeTests\Zope\lib\python\Products\CMFDefault\MembershipTool.py", line 45, in ?
class MembershipTool ( Products.CMFCore.MembershipTool.MembershipTool ):
No test suite found in file:
E:\ZopeTests\Zope\lib\python\Products\CMFCore\tests\test_all.py
Module test_CatalogTool.py failed to load
exceptions.ImportError: cannot import name CatalogTool
File "Utilities\testrunner.py", line 60, in getSuiteFromFile
File "test_CatalogTool.py", line 7, in ?
from Products.CMFCore.CatalogTool import CatalogTool
Module test_PortalFolder.py failed to load
exceptions.ImportError: cannot import name CatalogTool
File "Utilities\testrunner.py", line 60, in getSuiteFromFile
File "E:\ZopeTests\Zope\lib\python\Products\CMFCore\tests\test_PortalFolder.py", line 16, in ?
from Products.CMFCore.CatalogTool import CatalogTool
No test suite found in file:
E:\ZopeTests\Zope\lib\python\Products\CMFDefault\tests\test_all.py
Module test_Discussions.py failed to load
exceptions.ImportError: cannot import name CatalogTool
File "Utilities\testrunner.py", line 60, in getSuiteFromFile
File "E:\ZopeTests\Zope\lib\python\Products\CMFDefault\tests\test_Discussions.py", line 13, in ?
from Products.CMFCore.CatalogTool import CatalogTool
No test suite found in file:
E:\ZopeTests\Zope\lib\python\Products\CMFTracker\tests\test_all.py
Module test_IssueDescription.py failed to load
exceptions.NameError: name 'BaseTrackerTestCase' is not defined
File "Utilities\testrunner.py", line 60, in getSuiteFromFile
File "E:\ZopeTests\Zope\lib\python\Products\CMFTracker\tests\test_IssueDescription.py", line 4, in ?
class TestIssueDescription( BaseTrackerTestCase ):
Module testFieldIndex.py failed to load
exceptions.ImportError: cannot import name OOBTree
File "Utilities\testrunner.py", line 60, in getSuiteFromFile
File "testFieldIndex.py", line 17, in ?
from Products.PluginIndexes.FieldIndex.FieldIndex import FieldIndex
File "E:\ZopeTests\Zope\lib\python\Products\PluginIndexes\FieldIndex\FieldIndex.py", line 25, in ?
from BTrees.OOBTree import OOBTree, OOSet
Module testKeywordIndex.py failed to load
exceptions.ImportError: cannot import name OOSet
File "Utilities\testrunner.py", line 60, in getSuiteFromFile
File "testKeywordIndex.py", line 15, in ?
from Products.PluginIndexes.KeywordIndex.KeywordIndex import KeywordIndex
File "E:\ZopeTests\Zope\lib\python\Products\PluginIndexes\KeywordIndex\KeywordIndex.py", line 16, in ?
from BTrees.OOBTree import OOSet, difference
Module testPathIndex.py failed to load
exceptions.ImportError: No module named _IOBTree
File "Utilities\testrunner.py", line 60, in getSuiteFromFile
File "testPathIndex.py", line 16, in ?
from Products.PluginIndexes.PathIndex.PathIndex import PathIndex
File "E:\ZopeTests\Zope\lib\python\Products\PluginIndexes\PathIndex\PathIndex.py", line 24, in ?
from BTrees.IOBTree import IOBTree
File "E:\ZopeTests\Zope\lib\python\BTrees\IOBTree.py", line 16, in ?
from _IOBTree import *
Module testUnicodeSplitter.py failed to load
exceptions.ImportError: No module named UnicodeSplitter
File "Utilities\testrunner.py", line 60, in getSuiteFromFile
File "testUnicodeSplitter.py", line 2, in ?
from Products.PluginIndexes.TextIndex.Splitter.UnicodeSplitter.UnicodeSplitter import UnicodeSplitter
File "E:\ZopeTests\Zope\lib\python\Products\PluginIndexes\TextIndex\Splitter\UnicodeSplitter\__init__.py", line 1, in ?
from UnicodeSplitter import UnicodeSplitter as Splitter
Module testTextIndex.py failed to load
exceptions.ImportError: cannot import name OOBTree
File "Utilities\testrunner.py", line 60, in getSuiteFromFile
File "testTextIndex.py", line 23, in ?
import ZODB, ZODB.DemoStorage, ZODB.FileStorage
File "E:\ZopeTests\Zope\lib\python\ZODB\DemoStorage.py", line 88, in ?
from BTrees import OOBTree
Module testSessionDataManager.py failed to load
exceptions.ImportError: cannot import name OOBTree
File "Utilities\testrunner.py", line 60, in getSuiteFromFile
File "testSessionDataManager.py", line 25, in ?
from Products.Transience.Transience import \
File "E:\ZopeTests\Zope\lib\python\Products\Transience\__init__.py", line 20, in ?
import Transience
File "E:\ZopeTests\Zope\lib\python\Products\Transience\Transience.py", line 31, in ?
from BTrees import OOBTree
Module testTimeoutRelated.py failed to load
exceptions.ImportError: cannot import name TransientObjectContainer
File "Utilities\testrunner.py", line 60, in getSuiteFromFile
File "testTimeoutRelated.py", line 11, in ?
from Products.Transience.Transience import TransientObjectContainer
Module testTransientObject.py failed to load
exceptions.ImportError: cannot import name TransientObjectContainer
File "Utilities\testrunner.py", line 60, in getSuiteFromFile
File "testTransientObject.py", line 19, in ?
from Products.Transience.Transience import TransientObjectContainer
Module testTransientObjectContainer.py failed to load
exceptions.ImportError: cannot import name TransientObjectContainer
File "Utilities\testrunner.py", line 60, in getSuiteFromFile
File "testTransientObjectContainer.py", line 19, in ?
from Products.Transience.Transience import TransientObjectContainer,\
Module testCatalog.py failed to load
exceptions.ImportError: cannot import name DemoStorage
File "Utilities\testrunner.py", line 60, in getSuiteFromFile
File "testCatalog.py", line 8, in ?
from ZODB.DemoStorage import DemoStorage
Module testfsIndex.py failed to load
exceptions.ImportError: cannot import name fsIndex
File "Utilities\testrunner.py", line 60, in getSuiteFromFile
File "testfsIndex.py", line 3, in ?
from ZODB.fsIndex import fsIndex
======================================================================
ERROR: test_Condition (test_ActionInformation.ActionInformationTests)
----------------------------------------------------------------------
Traceback (most recent call last):
File "test_ActionInformation.py", line 17, in setUp
File "E:\ZopeTests\Zope\lib\python\Products\CMFCore\tests\base\testcase.py", line 13, in setUp
self.connection = Zope.DB.open()
AttributeError: 'Zope' module has no attribute 'DB'
======================================================================
ERROR: test_basic_construction (test_ActionInformation.ActionInformationTests)
----------------------------------------------------------------------
Traceback (most recent call last):
File "test_ActionInformation.py", line 17, in setUp
File "E:\ZopeTests\Zope\lib\python\Products\CMFCore\tests\base\testcase.py", line 13, in setUp
self.connection = Zope.DB.open()
AttributeError: 'Zope' module has no attribute 'DB'
======================================================================
ERROR: test_construction_with_Expressions (test_ActionInformation.ActionInformationTests)
----------------------------------------------------------------------
Traceback (most recent call last):
File "test_ActionInformation.py", line 17, in setUp
File "E:\ZopeTests\Zope\lib\python\Products\CMFCore\tests\base\testcase.py", line 13, in setUp
self.connection = Zope.DB.open()
AttributeError: 'Zope' module has no attribute 'DB'
======================================================================
ERROR: test_anonymous_ec (test_Expression.ExpressionTests)
----------------------------------------------------------------------
Traceback (most recent call last):
File "test_Expression.py", line 17, in setUp
File "E:\ZopeTests\Zope\lib\python\Products\CMFCore\tests\base\testcase.py", line 35, in setUp
self.connection = Zope.DB.open()
AttributeError: 'Zope' module has no attribute 'DB'
======================================================================
ERROR: test_authenticatedUser_ec (test_Expression.ExpressionTests)
----------------------------------------------------------------------
Traceback (most recent call last):
File "test_Expression.py", line 17, in setUp
File "E:\ZopeTests\Zope\lib\python\Products\CMFCore\tests\base\testcase.py", line 35, in setUp
self.connection = Zope.DB.open()
AttributeError: 'Zope' module has no attribute 'DB'
======================================================================
ERROR: test_ec_context (test_Expression.ExpressionTests)
----------------------------------------------------------------------
Traceback (most recent call last):
File "test_Expression.py", line 17, in setUp
File "E:\ZopeTests\Zope\lib\python\Products\CMFCore\tests\base\testcase.py", line 35, in setUp
self.connection = Zope.DB.open()
AttributeError: 'Zope' module has no attribute 'DB'
======================================================================
ERROR: test_BadCall (test_FSPageTemplate.FSPageTemplateTests)
----------------------------------------------------------------------
Traceback (most recent call last):
File "test_FSPageTemplate.py", line 24, in test_BadCall
AttributeError: 'Zope' module has no attribute 'app'
======================================================================
ERROR: test_Call (test_FSPageTemplate.FSPageTemplateTests)
----------------------------------------------------------------------
Traceback (most recent call last):
File "test_FSPageTemplate.py", line 15, in test_Call
AttributeError: 'Zope' module has no attribute 'app'
======================================================================
ERROR: test_AddingOtherTypeInfos (test_TypesTool.TypesToolTests)
----------------------------------------------------------------------
Traceback (most recent call last):
File "test_TypesTool.py", line 30, in setUp
File "E:\ZopeTests\Zope\lib\python\Products\CMFCore\tests\base\testcase.py", line 48, in setUp
SecurityTest.setUp(self)
File "E:\ZopeTests\Zope\lib\python\Products\CMFCore\tests\base\testcase.py", line 35, in setUp
self.connection = Zope.DB.open()
AttributeError: 'Zope' module has no attribute 'DB'
======================================================================
ERROR: test_allMetaTypes (test_TypesTool.TypesToolTests)
----------------------------------------------------------------------
Traceback (most recent call last):
File "test_TypesTool.py", line 30, in setUp
File "E:\ZopeTests\Zope\lib\python\Products\CMFCore\tests\base\testcase.py", line 48, in setUp
SecurityTest.setUp(self)
File "E:\ZopeTests\Zope\lib\python\Products\CMFCore\tests\base\testcase.py", line 35, in setUp
self.connection = Zope.DB.open()
AttributeError: 'Zope' module has no attribute 'DB'
======================================================================
ERROR: test_processActions (test_TypesTool.TypesToolTests)
----------------------------------------------------------------------
Traceback (most recent call last):
File "test_TypesTool.py", line 30, in setUp
File "E:\ZopeTests\Zope\lib\python\Products\CMFCore\tests\base\testcase.py", line 48, in setUp
SecurityTest.setUp(self)
File "E:\ZopeTests\Zope\lib\python\Products\CMFCore\tests\base\testcase.py", line 35, in setUp
self.connection = Zope.DB.open()
AttributeError: 'Zope' module has no attribute 'DB'
======================================================================
ERROR: test_BasicHtmlPUT (test_Document.DocumentTests)
----------------------------------------------------------------------
Traceback (most recent call last):
File "test_Document.py", line 18, in setUp
File "E:\ZopeTests\Zope\lib\python\Products\CMFCore\tests\base\testcase.py", line 23, in setUp
TransactionalTest.setUp(self)
File "E:\ZopeTests\Zope\lib\python\Products\CMFCore\tests\base\testcase.py", line 13, in setUp
self.connection = Zope.DB.open()
AttributeError: 'Zope' module has no attribute 'DB'
======================================================================
ERROR: test_BigHtml (test_Document.DocumentTests)
----------------------------------------------------------------------
Traceback (most recent call last):
File "test_Document.py", line 18, in setUp
File "E:\ZopeTests\Zope\lib\python\Products\CMFCore\tests\base\testcase.py", line 23, in setUp
TransactionalTest.setUp(self)
File "E:\ZopeTests\Zope\lib\python\Products\CMFCore\tests\base\testcase.py", line 13, in setUp
self.connection = Zope.DB.open()
AttributeError: 'Zope' module has no attribute 'DB'
======================================================================
ERROR: test_BigHtml_via_upload (test_Document.DocumentTests)
----------------------------------------------------------------------
Traceback (most recent call last):
File "test_Document.py", line 18, in setUp
File "E:\ZopeTests\Zope\lib\python\Products\CMFCore\tests\base\testcase.py", line 23, in setUp
TransactionalTest.setUp(self)
File "E:\ZopeTests\Zope\lib\python\Products\CMFCore\tests\base\testcase.py", line 13, in setUp
self.connection = Zope.DB.open()
AttributeError: 'Zope' module has no attribute 'DB'
======================================================================
ERROR: test_EditStructuredTextWithHTML (test_Document.DocumentTests)
----------------------------------------------------------------------
Traceback (most recent call last):
File "test_Document.py", line 18, in setUp
File "E:\ZopeTests\Zope\lib\python\Products\CMFCore\tests\base\testcase.py", line 23, in setUp
TransactionalTest.setUp(self)
File "E:\ZopeTests\Zope\lib\python\Products\CMFCore\tests\base\testcase.py", line 13, in setUp
self.connection = Zope.DB.open()
AttributeError: 'Zope' module has no attribute 'DB'
======================================================================
ERROR: test_Empty (test_Document.DocumentTests)
----------------------------------------------------------------------
Traceback (most recent call last):
File "test_Document.py", line 18, in setUp
File "E:\ZopeTests\Zope\lib\python\Products\CMFCore\tests\base\testcase.py", line 23, in setUp
TransactionalTest.setUp(self)
File "E:\ZopeTests\Zope\lib\python\Products\CMFCore\tests\base\testcase.py", line 13, in setUp
self.connection = Zope.DB.open()
AttributeError: 'Zope' module has no attribute 'DB'
======================================================================
ERROR: test_EntityInTitle (test_Document.DocumentTests)
----------------------------------------------------------------------
Traceback (most recent call last):
File "test_Document.py", line 18, in setUp
File "E:\ZopeTests\Zope\lib\python\Products\CMFCore\tests\base\testcase.py", line 23, in setUp
TransactionalTest.setUp(self)
File "E:\ZopeTests\Zope\lib\python\Products\CMFCore\tests\base\testcase.py", line 13, in setUp
self.connection = Zope.DB.open()
AttributeError: 'Zope' module has no attribute 'DB'
======================================================================
ERROR: test_HtmlWithDoctype (test_Document.DocumentTests)
----------------------------------------------------------------------
Traceback (most recent call last):
File "test_Document.py", line 18, in setUp
File "E:\ZopeTests\Zope\lib\python\Products\CMFCore\tests\base\testcase.py", line 23, in setUp
TransactionalTest.setUp(self)
File "E:\ZopeTests\Zope\lib\python\Products\CMFCore\tests\base\testcase.py", line 13, in setUp
self.connection = Zope.DB.open()
AttributeError: 'Zope' module has no attribute 'DB'
======================================================================
ERROR: test_HtmlWithoutNewlines (test_Document.DocumentTests)
----------------------------------------------------------------------
Traceback (most recent call last):
File "test_Document.py", line 18, in setUp
File "E:\ZopeTests\Zope\lib\python\Products\CMFCore\tests\base\testcase.py", line 23, in setUp
TransactionalTest.setUp(self)
File "E:\ZopeTests\Zope\lib\python\Products\CMFCore\tests\base\testcase.py", line 13, in setUp
self.connection = Zope.DB.open()
AttributeError: 'Zope' module has no attribute 'DB'
======================================================================
ERROR: test_Init (test_Document.DocumentTests)
----------------------------------------------------------------------
Traceback (most recent call last):
File "test_Document.py", line 18, in setUp
File "E:\ZopeTests\Zope\lib\python\Products\CMFCore\tests\base\testcase.py", line 23, in setUp
TransactionalTest.setUp(self)
File "E:\ZopeTests\Zope\lib\python\Products\CMFCore\tests\base\testcase.py", line 13, in setUp
self.connection = Zope.DB.open()
AttributeError: 'Zope' module has no attribute 'DB'
======================================================================
ERROR: test_STX_Levels (test_Document.DocumentTests)
----------------------------------------------------------------------
Traceback (most recent call last):
File "test_Document.py", line 18, in setUp
File "E:\ZopeTests\Zope\lib\python\Products\CMFCore\tests\base\testcase.py", line 23, in setUp
TransactionalTest.setUp(self)
File "E:\ZopeTests\Zope\lib\python\Products\CMFCore\tests\base\testcase.py", line 13, in setUp
self.connection = Zope.DB.open()
AttributeError: 'Zope' module has no attribute 'DB'
======================================================================
ERROR: test_STX_NoHeaders (test_Document.DocumentTests)
----------------------------------------------------------------------
Traceback (most recent call last):
File "test_Document.py", line 18, in setUp
File "E:\ZopeTests\Zope\lib\python\Products\CMFCore\tests\base\testcase.py", line 23, in setUp
TransactionalTest.setUp(self)
File "E:\ZopeTests\Zope\lib\python\Products\CMFCore\tests\base\testcase.py", line 13, in setUp
self.connection = Zope.DB.open()
AttributeError: 'Zope' module has no attribute 'DB'
======================================================================
ERROR: test_STX_NoHeaders_but_colon (test_Document.DocumentTests)
----------------------------------------------------------------------
Traceback (most recent call last):
File "test_Document.py", line 18, in setUp
File "E:\ZopeTests\Zope\lib\python\Products\CMFCore\tests\base\testcase.py", line 23, in setUp
TransactionalTest.setUp(self)
File "E:\ZopeTests\Zope\lib\python\Products\CMFCore\tests\base\testcase.py", line 13, in setUp
self.connection = Zope.DB.open()
AttributeError: 'Zope' module has no attribute 'DB'
======================================================================
ERROR: test_StructuredText (test_Document.DocumentTests)
----------------------------------------------------------------------
Traceback (most recent call last):
File "test_Document.py", line 18, in setUp
File "E:\ZopeTests\Zope\lib\python\Products\CMFCore\tests\base\testcase.py", line 23, in setUp
TransactionalTest.setUp(self)
File "E:\ZopeTests\Zope\lib\python\Products\CMFCore\tests\base\testcase.py", line 13, in setUp
self.connection = Zope.DB.open()
AttributeError: 'Zope' module has no attribute 'DB'
======================================================================
ERROR: test_UpperedHtml (test_Document.DocumentTests)
----------------------------------------------------------------------
Traceback (most recent call last):
File "test_Document.py", line 18, in setUp
File "E:\ZopeTests\Zope\lib\python\Products\CMFCore\tests\base\testcase.py", line 23, in setUp
TransactionalTest.setUp(self)
File "E:\ZopeTests\Zope\lib\python\Products\CMFCore\tests\base\testcase.py", line 13, in setUp
self.connection = Zope.DB.open()
AttributeError: 'Zope' module has no attribute 'DB'
======================================================================
ERROR: test_ZMI_edit (test_Document.DocumentTests)
----------------------------------------------------------------------
Traceback (most recent call last):
File "test_Document.py", line 18, in setUp
File "E:\ZopeTests\Zope\lib\python\Products\CMFCore\tests\base\testcase.py", line 23, in setUp
TransactionalTest.setUp(self)
File "E:\ZopeTests\Zope\lib\python\Products\CMFCore\tests\base\testcase.py", line 13, in setUp
self.connection = Zope.DB.open()
AttributeError: 'Zope' module has no attribute 'DB'
======================================================================
ERROR: testHTML (test_Document.TestFTPGet)
----------------------------------------------------------------------
Traceback (most recent call last):
File "E:\ZopeTests\Zope\lib\python\Products\CMFCore\tests\base\testcase.py", line 23, in setUp
TransactionalTest.setUp(self)
File "E:\ZopeTests\Zope\lib\python\Products\CMFCore\tests\base\testcase.py", line 13, in setUp
self.connection = Zope.DB.open()
AttributeError: 'Zope' module has no attribute 'DB'
======================================================================
ERROR: testSTX (test_Document.TestFTPGet)
----------------------------------------------------------------------
Traceback (most recent call last):
File "E:\ZopeTests\Zope\lib\python\Products\CMFCore\tests\base\testcase.py", line 23, in setUp
TransactionalTest.setUp(self)
File "E:\ZopeTests\Zope\lib\python\Products\CMFCore\tests\base\testcase.py", line 13, in setUp
self.connection = Zope.DB.open()
AttributeError: 'Zope' module has no attribute 'DB'
======================================================================
ERROR: test_PutHtml (test_Document.TestDocumentPUT)
----------------------------------------------------------------------
Traceback (most recent call last):
File "test_Document.py", line 316, in setUp
File "E:\ZopeTests\Zope\lib\python\Products\CMFCore\tests\base\testcase.py", line 23, in setUp
TransactionalTest.setUp(self)
File "E:\ZopeTests\Zope\lib\python\Products\CMFCore\tests\base\testcase.py", line 13, in setUp
self.connection = Zope.DB.open()
AttributeError: 'Zope' module has no attribute 'DB'
======================================================================
ERROR: test_PutHtmlWithDoctype (test_Document.TestDocumentPUT)
----------------------------------------------------------------------
Traceback (most recent call last):
File "test_Document.py", line 316, in setUp
File "E:\ZopeTests\Zope\lib\python\Products\CMFCore\tests\base\testcase.py", line 23, in setUp
TransactionalTest.setUp(self)
File "E:\ZopeTests\Zope\lib\python\Products\CMFCore\tests\base\testcase.py", line 13, in setUp
self.connection = Zope.DB.open()
AttributeError: 'Zope' module has no attribute 'DB'
======================================================================
ERROR: test_PutStructuredText (test_Document.TestDocumentPUT)
----------------------------------------------------------------------
Traceback (most recent call last):
File "test_Document.py", line 316, in setUp
File "E:\ZopeTests\Zope\lib\python\Products\CMFCore\tests\base\testcase.py", line 23, in setUp
TransactionalTest.setUp(self)
File "E:\ZopeTests\Zope\lib\python\Products\CMFCore\tests\base\testcase.py", line 13, in setUp
self.connection = Zope.DB.open()
AttributeError: 'Zope' module has no attribute 'DB'
======================================================================
ERROR: test_PutStructuredTextWithHTML (test_Document.TestDocumentPUT)
----------------------------------------------------------------------
Traceback (most recent call last):
File "test_Document.py", line 316, in setUp
File "E:\ZopeTests\Zope\lib\python\Products\CMFCore\tests\base\testcase.py", line 23, in setUp
TransactionalTest.setUp(self)
File "E:\ZopeTests\Zope\lib\python\Products\CMFCore\tests\base\testcase.py", line 13, in setUp
self.connection = Zope.DB.open()
AttributeError: 'Zope' module has no attribute 'DB'
======================================================================
ERROR: test_join (test_join.MembershipTests)
----------------------------------------------------------------------
Traceback (most recent call last):
File "E:\ZopeTests\Zope\lib\python\Products\CMFCore\tests\base\testcase.py", line 13, in setUp
self.connection = Zope.DB.open()
AttributeError: 'Zope' module has no attribute 'DB'
======================================================================
ERROR: test_BasicHtml (test_NewsItem.NewsItemTests)
----------------------------------------------------------------------
Traceback (most recent call last):
File "test_NewsItem.py", line 14, in setUp
File "E:\ZopeTests\Zope\lib\python\Products\CMFCore\tests\base\testcase.py", line 23, in setUp
TransactionalTest.setUp(self)
File "E:\ZopeTests\Zope\lib\python\Products\CMFCore\tests\base\testcase.py", line 13, in setUp
self.connection = Zope.DB.open()
AttributeError: 'Zope' module has no attribute 'DB'
======================================================================
ERROR: test_Empty (test_NewsItem.NewsItemTests)
----------------------------------------------------------------------
Traceback (most recent call last):
File "test_NewsItem.py", line 14, in setUp
File "E:\ZopeTests\Zope\lib\python\Products\CMFCore\tests\base\testcase.py", line 23, in setUp
TransactionalTest.setUp(self)
File "E:\ZopeTests\Zope\lib\python\Products\CMFCore\tests\base\testcase.py", line 13, in setUp
self.connection = Zope.DB.open()
AttributeError: 'Zope' module has no attribute 'DB'
======================================================================
ERROR: test_EntityInTitle (test_NewsItem.NewsItemTests)
----------------------------------------------------------------------
Traceback (most recent call last):
File "test_NewsItem.py", line 14, in setUp
File "E:\ZopeTests\Zope\lib\python\Products\CMFCore\tests\base\testcase.py", line 23, in setUp
TransactionalTest.setUp(self)
File "E:\ZopeTests\Zope\lib\python\Products\CMFCore\tests\base\testcase.py", line 13, in setUp
self.connection = Zope.DB.open()
AttributeError: 'Zope' module has no attribute 'DB'
======================================================================
ERROR: test_HtmlWithDoctype (test_NewsItem.NewsItemTests)
----------------------------------------------------------------------
Traceback (most recent call last):
File "test_NewsItem.py", line 14, in setUp
File "E:\ZopeTests\Zope\lib\python\Products\CMFCore\tests\base\testcase.py", line 23, in setUp
TransactionalTest.setUp(self)
File "E:\ZopeTests\Zope\lib\python\Products\CMFCore\tests\base\testcase.py", line 13, in setUp
self.connection = Zope.DB.open()
AttributeError: 'Zope' module has no attribute 'DB'
======================================================================
ERROR: test_HtmlWithoutNewlines (test_NewsItem.NewsItemTests)
----------------------------------------------------------------------
Traceback (most recent call last):
File "test_NewsItem.py", line 14, in setUp
File "E:\ZopeTests\Zope\lib\python\Products\CMFCore\tests\base\testcase.py", line 23, in setUp
TransactionalTest.setUp(self)
File "E:\ZopeTests\Zope\lib\python\Products\CMFCore\tests\base\testcase.py", line 13, in setUp
self.connection = Zope.DB.open()
AttributeError: 'Zope' module has no attribute 'DB'
======================================================================
ERROR: test_Init (test_NewsItem.NewsItemTests)
----------------------------------------------------------------------
Traceback (most recent call last):
File "test_NewsItem.py", line 14, in setUp
File "E:\ZopeTests\Zope\lib\python\Products\CMFCore\tests\base\testcase.py", line 23, in setUp
TransactionalTest.setUp(self)
File "E:\ZopeTests\Zope\lib\python\Products\CMFCore\tests\base\testcase.py", line 13, in setUp
self.connection = Zope.DB.open()
AttributeError: 'Zope' module has no attribute 'DB'
======================================================================
ERROR: test_StructuredText (test_NewsItem.NewsItemTests)
----------------------------------------------------------------------
Traceback (most recent call last):
File "test_NewsItem.py", line 14, in setUp
File "E:\ZopeTests\Zope\lib\python\Products\CMFCore\tests\base\testcase.py", line 23, in setUp
TransactionalTest.setUp(self)
File "E:\ZopeTests\Zope\lib\python\Products\CMFCore\tests\base\testcase.py", line 13, in setUp
self.connection = Zope.DB.open()
AttributeError: 'Zope' module has no attribute 'DB'
======================================================================
ERROR: test_UpperedHtml (test_NewsItem.NewsItemTests)
----------------------------------------------------------------------
Traceback (most recent call last):
File "test_NewsItem.py", line 14, in setUp
File "E:\ZopeTests\Zope\lib\python\Products\CMFCore\tests\base\testcase.py", line 23, in setUp
TransactionalTest.setUp(self)
File "E:\ZopeTests\Zope\lib\python\Products\CMFCore\tests\base\testcase.py", line 13, in setUp
self.connection = Zope.DB.open()
AttributeError: 'Zope' module has no attribute 'DB'
======================================================================
ERROR: test ISOSplitter
----------------------------------------------------------------------
Traceback (most recent call last):
File "testSplitter.py", line 67, in testISOSplitter
File "testSplitter.py", line 52, in _test
File "E:\ZopeTests\Zope\lib\python\Products\PluginIndexes\TextIndex\Splitter\__init__.py", line 31, in getSplitter
exec( "from %s import Splitter as %s" % (name,name))
File "<string>", line 1, in ?
File "E:\ZopeTests\Zope\lib\python\Products\PluginIndexes\TextIndex\Splitter\ISO_8859_1_Splitter\__init__.py", line 1, in ?
from ISO_8859_1_Splitter import ISO_8859_1_Splitter
ImportError: No module named ISO_8859_1_Splitter
======================================================================
ERROR: checkAbortAfterVote (testDemoStorage.DemoStorageTests)
----------------------------------------------------------------------
Traceback (most recent call last):
File "testDemoStorage.py", line 14, in setUp
AttributeError: 'ZODB' module has no attribute 'DemoStorage'
======================================================================
ERROR: checkAbortNotCommitting (testDemoStorage.DemoStorageTests)
----------------------------------------------------------------------
Traceback (most recent call last):
File "testDemoStorage.py", line 14, in setUp
AttributeError: 'ZODB' module has no attribute 'DemoStorage'
======================================================================
ERROR: checkAbortOneVersionCommitTheOther (testDemoStorage.DemoStorageTests)
----------------------------------------------------------------------
Traceback (most recent call last):
File "testDemoStorage.py", line 14, in setUp
AttributeError: 'ZODB' module has no attribute 'DemoStorage'
======================================================================
ERROR: checkAbortVersion (testDemoStorage.DemoStorageTests)
----------------------------------------------------------------------
Traceback (most recent call last):
File "testDemoStorage.py", line 14, in setUp
AttributeError: 'ZODB' module has no attribute 'DemoStorage'
======================================================================
ERROR: checkAbortVersionErrors (testDemoStorage.DemoStorageTests)
----------------------------------------------------------------------
Traceback (most recent call last):
File "testDemoStorage.py", line 14, in setUp
AttributeError: 'ZODB' module has no attribute 'DemoStorage'
======================================================================
ERROR: checkAbortVersionNotCommitting (testDemoStorage.DemoStorageTests)
----------------------------------------------------------------------
Traceback (most recent call last):
File "testDemoStorage.py", line 14, in setUp
AttributeError: 'ZODB' module has no attribute 'DemoStorage'
======================================================================
ERROR: checkAbortVersionWrongTrans (testDemoStorage.DemoStorageTests)
----------------------------------------------------------------------
Traceback (most recent call last):
File "testDemoStorage.py", line 14, in setUp
AttributeError: 'ZODB' module has no attribute 'DemoStorage'
======================================================================
ERROR: checkAbortWrongTrans (testDemoStorage.DemoStorageTests)
----------------------------------------------------------------------
Traceback (most recent call last):
File "testDemoStorage.py", line 14, in setUp
AttributeError: 'ZODB' module has no attribute 'DemoStorage'
======================================================================
ERROR: checkBasics (testDemoStorage.DemoStorageTests)
----------------------------------------------------------------------
Traceback (most recent call last):
File "testDemoStorage.py", line 14, in setUp
AttributeError: 'ZODB' module has no attribute 'DemoStorage'
======================================================================
ERROR: checkBeginCommitting (testDemoStorage.DemoStorageTests)
----------------------------------------------------------------------
Traceback (most recent call last):
File "testDemoStorage.py", line 14, in setUp
AttributeError: 'ZODB' module has no attribute 'DemoStorage'
======================================================================
ERROR: checkCommitToNonVersion (testDemoStorage.DemoStorageTests)
----------------------------------------------------------------------
Traceback (most recent call last):
File "testDemoStorage.py", line 14, in setUp
AttributeError: 'ZODB' module has no attribute 'DemoStorage'
======================================================================
ERROR: checkCommitToOtherVersion (testDemoStorage.DemoStorageTests)
----------------------------------------------------------------------
Traceback (most recent call last):
File "testDemoStorage.py", line 14, in setUp
AttributeError: 'ZODB' module has no attribute 'DemoStorage'
======================================================================
ERROR: checkCommitVersionErrors (testDemoStorage.DemoStorageTests)
----------------------------------------------------------------------
Traceback (most recent call last):
File "testDemoStorage.py", line 14, in setUp
AttributeError: 'ZODB' module has no attribute 'DemoStorage'
======================================================================
ERROR: checkCommitVersionNotCommitting (testDemoStorage.DemoStorageTests)
----------------------------------------------------------------------
Traceback (most recent call last):
File "testDemoStorage.py", line 14, in setUp
AttributeError: 'ZODB' module has no attribute 'DemoStorage'
======================================================================
ERROR: checkCommitVersionWrongTrans (testDemoStorage.DemoStorageTests)
----------------------------------------------------------------------
Traceback (most recent call last):
File "testDemoStorage.py", line 14, in setUp
AttributeError: 'ZODB' module has no attribute 'DemoStorage'
======================================================================
ERROR: checkConflicts (testDemoStorage.DemoStorageTests)
----------------------------------------------------------------------
Traceback (most recent call last):
File "testDemoStorage.py", line 14, in setUp
AttributeError: 'ZODB' module has no attribute 'DemoStorage'
======================================================================
ERROR: checkFinishNotCommitting (testDemoStorage.DemoStorageTests)
----------------------------------------------------------------------
Traceback (most recent call last):
File "testDemoStorage.py", line 14, in setUp
AttributeError: 'ZODB' module has no attribute 'DemoStorage'
======================================================================
ERROR: checkFinishWrongTrans (testDemoStorage.DemoStorageTests)
----------------------------------------------------------------------
Traceback (most recent call last):
File "testDemoStorage.py", line 14, in setUp
AttributeError: 'ZODB' module has no attribute 'DemoStorage'
======================================================================
ERROR: checkGetSerial (testDemoStorage.DemoStorageTests)
----------------------------------------------------------------------
Traceback (most recent call last):
File "testDemoStorage.py", line 14, in setUp
AttributeError: 'ZODB' module has no attribute 'DemoStorage'
======================================================================
ERROR: checkModifyAfterAbortVersion (testDemoStorage.DemoStorageTests)
----------------------------------------------------------------------
Traceback (most recent call last):
File "testDemoStorage.py", line 14, in setUp
AttributeError: 'ZODB' module has no attribute 'DemoStorage'
======================================================================
ERROR: checkNonVersionModifiedInVersion (testDemoStorage.DemoStorageTests)
----------------------------------------------------------------------
Traceback (most recent call last):
File "testDemoStorage.py", line 14, in setUp
AttributeError: 'ZODB' module has no attribute 'DemoStorage'
======================================================================
ERROR: checkNonVersionStore (testDemoStorage.DemoStorageTests)
----------------------------------------------------------------------
Traceback (most recent call last):
File "testDemoStorage.py", line 14, in setUp
AttributeError: 'ZODB' module has no attribute 'DemoStorage'
======================================================================
ERROR: checkNonVersionStoreAndLoad (testDemoStorage.DemoStorageTests)
----------------------------------------------------------------------
Traceback (most recent call last):
File "testDemoStorage.py", line 14, in setUp
AttributeError: 'ZODB' module has no attribute 'DemoStorage'
======================================================================
ERROR: checkSerialIsNoneForInitialRevision (testDemoStorage.DemoStorageTests)
----------------------------------------------------------------------
Traceback (most recent call last):
File "testDemoStorage.py", line 14, in setUp
AttributeError: 'ZODB' module has no attribute 'DemoStorage'
======================================================================
ERROR: checkStoreNotCommitting (testDemoStorage.DemoStorageTests)
----------------------------------------------------------------------
Traceback (most recent call last):
File "testDemoStorage.py", line 14, in setUp
AttributeError: 'ZODB' module has no attribute 'DemoStorage'
======================================================================
ERROR: checkStoreTwoObjects (testDemoStorage.DemoStorageTests)
----------------------------------------------------------------------
Traceback (most recent call last):
File "testDemoStorage.py", line 14, in setUp
AttributeError: 'ZODB' module has no attribute 'DemoStorage'
======================================================================
ERROR: checkStoreWrongTrans (testDemoStorage.DemoStorageTests)
----------------------------------------------------------------------
Traceback (most recent call last):
File "testDemoStorage.py", line 14, in setUp
AttributeError: 'ZODB' module has no attribute 'DemoStorage'
======================================================================
ERROR: checkTwoArgBegin (testDemoStorage.DemoStorageTests)
----------------------------------------------------------------------
Traceback (most recent call last):
File "testDemoStorage.py", line 14, in setUp
AttributeError: 'ZODB' module has no attribute 'DemoStorage'
======================================================================
ERROR: checkVersionEmpty (testDemoStorage.DemoStorageTests)
----------------------------------------------------------------------
Traceback (most recent call last):
File "testDemoStorage.py", line 14, in setUp
AttributeError: 'ZODB' module has no attribute 'DemoStorage'
======================================================================
ERROR: checkVersionLock (testDemoStorage.DemoStorageTests)
----------------------------------------------------------------------
Traceback (most recent call last):
File "testDemoStorage.py", line 14, in setUp
AttributeError: 'ZODB' module has no attribute 'DemoStorage'
======================================================================
ERROR: checkVersionedLoadErrors (testDemoStorage.DemoStorageTests)
----------------------------------------------------------------------
Traceback (most recent call last):
File "testDemoStorage.py", line 14, in setUp
AttributeError: 'ZODB' module has no attribute 'DemoStorage'
======================================================================
ERROR: checkVersionedStoreAndLoad (testDemoStorage.DemoStorageTests)
----------------------------------------------------------------------
Traceback (most recent call last):
File "testDemoStorage.py", line 14, in setUp
AttributeError: 'ZODB' module has no attribute 'DemoStorage'
======================================================================
ERROR: checkVersions (testDemoStorage.DemoStorageTests)
----------------------------------------------------------------------
Traceback (most recent call last):
File "testDemoStorage.py", line 14, in setUp
AttributeError: 'ZODB' module has no attribute 'DemoStorage'
======================================================================
ERROR: checkWriteAfterAbort (testDemoStorage.DemoStorageTests)
----------------------------------------------------------------------
Traceback (most recent call last):
File "testDemoStorage.py", line 14, in setUp
AttributeError: 'ZODB' module has no attribute 'DemoStorage'
======================================================================
FAIL: test_isConstructionAllowed_wo_Security (test_TypesTool.FTIConstructionTests)
----------------------------------------------------------------------
Traceback (most recent call last):
File "test_TypesTool.py", line 342, in test_isConstructionAllowed_wo_Security
File "c:\python21\lib\unittest.py", line 245, in failIf
if expr: raise self.failureException, msg
AssertionError
======================================================================
FAIL: test_constructInstance_wo_Roles (test_TypesTool.FTIConstructionTests_w_Roles)
----------------------------------------------------------------------
Traceback (most recent call last):
File "test_TypesTool.py", line 393, in test_constructInstance_wo_Roles
File "c:\python21\lib\unittest.py", line 266, in failUnlessRaises
raise self.failureException, excName
AssertionError: Unauthorized
======================================================================
FAIL: test_isConstructionAllowed_wo_Role (test_TypesTool.FTIConstructionTests_w_Roles)
----------------------------------------------------------------------
Traceback (most recent call last):
File "test_TypesTool.py", line 383, in test_isConstructionAllowed_wo_Role
File "c:\python21\lib\unittest.py", line 266, in failUnlessRaises
raise self.failureException, excName
AssertionError: Unauthorized
======================================================================
FAIL: check_simple_html (test_xmlparser.XMLParserTestCase)
----------------------------------------------------------------------
Traceback (most recent call last):
File "test_xmlparser.py", line 114, in check_simple_html
File "test_xmlparser.py", line 95, in _run_check
File "c:\python21\lib\unittest.py", line 273, in failUnlessEqual
raise self.failureException, (msg or '%s != %s' % (first, second))
AssertionError: [('starttag', u'html', []), ('data', u' \n'), ('comment', u'comment1a\n-></foo><bar><<?pi?></foo<bar\ncomment1b'), ('data', u'\n'), ('starttag', u'img', [u'src', u'Bar', u'ismap', u'']), ('endtag', u'img'), ('data', u'sample\ntext\n'), ('comment', u'comment2a- -comment2b'), ('data', u'\n'), ('endtag', u'html')] != [('decl', '1.0', 'iso-8859-1', -1), ('doctype', 'html', 'foo', 'bar', 0), ('starttag', 'html', []), ('data', ' \n'), ('comment', 'comment1a\n-></foo><bar><<?pi?></foo<bar\ncomment1b'), ('data', '\n'), ('starttag', 'img', ['src', 'Bar', 'ismap', '']), ('endtag', 'img'), ('data', 'sample\ntext\n'), ('comment', 'comment2a- -comment2b'), ('data', '\n'), ('endtag', 'html')]
----------------------------------------------------------------------
Ran 729 tests in 42.310s
FAILED (failures=4, errors=76)
======================================================================
OVERALL FAILED (total failures=4, total errors=76)
================================================================================
================================================================================
================================================================================
================================================================================
Python Version:2.1.2 (#31, Jan 15 2002, 17:28:11) [MSC 32 bit (Intel)]
Modules included:
Zope (Zope-2_5-branch)
CMF/CMFCore (HEAD)
CMF/CMFCalendar (HEAD)
CMF/CMFCollector (HEAD)
CMF/CMFDecor (HEAD)
CMF/CMFDefault (HEAD)
CMF/CMFTopic (HEAD)
CMF/CMFTracker (HEAD)
CMF/CMFWiki (HEAD)
CMF/DCWorkflow (HEAD)
Module testFileStorage.py failed to load
exceptions.ImportError: cannot import name ReadOnlyStorage
File "Utilities\testrunner.py", line 60, in getSuiteFromFile
File "testFileStorage.py", line 8, in ?
from ZODB.tests import StorageTestBase, BasicStorage, \
======================================================================
FAIL: check_simple_html (test_xmlparser.XMLParserTestCase)
----------------------------------------------------------------------
Traceback (most recent call last):
File "test_xmlparser.py", line 114, in check_simple_html
File "test_xmlparser.py", line 95, in _run_check
File "c:\python21\lib\unittest.py", line 249, in failUnless
if not expr: raise self.failureException, msg
AssertionError: [('starttag', u'html', []), ('data', u' \n'), ('comment', u'comment1a\n-></foo><bar><<?pi?></foo<bar\ncomment1b'), ('data', u'\n'), ('starttag', u'img', [u'src', u'Bar', u'ismap', u'']), ('endtag', u'img'), ('data', u'sample\ntext\n'), ('comment', u'comment2a- -comment2b'), ('data', u'\n'), ('endtag', u'html')]
----------------------------------------------------------------------
Ran 1414 tests in 196.793s
FAILED (failures=1)
======================================================================
OVERALL FAILED (total failures=1)
================================================================================
================================================================================