[Zope-Coders] Zope test results

background@shane.zope.com background@shane.zope.com
Wed, 20 Feb 2002 22:11:59 -0500 (EST)


Packages included in tests: Zope, CMF, ZEO, bsddb3Storage

**********************************************************************
Zope CVS Head
**********************************************************************
Module testDemoStorage.py failed to load
exceptions.ImportError: No module named _OOBTree
  File "utilities/testrunner.py", line 60, in getSuiteFromFile
   File "testDemoStorage.py", line 1, in ?
    import ZODB.DemoStorage
   File "/home/background/zopetest/lib/python/ZODB/DemoStorage.py", line 88, in ?
    from BTrees import OOBTree
   File "/home/background/zopetest/lib/python/BTrees/OOBTree.py", line 16, in ?
    from _OOBTree import *


Module testfsIndex.py failed to load
exceptions.ImportError: cannot import name fsIndex
  File "utilities/testrunner.py", line 60, in getSuiteFromFile
   File "testfsIndex.py", line 3, in ?
    from ZODB.fsIndex import fsIndex


Module testCopySupport.py failed to load
exceptions.ImportError: No module named _IIBTree
  File "utilities/testrunner.py", line 60, in getSuiteFromFile
   File "testCopySupport.py", line 5, in ?
    from OFS.Application import Application
   File "/home/background/zopetest/lib/python/OFS/Application.py", line 18, in ?
    import Globals,Folder,os,sys,App.Product, App.ProductRegistry, misc_
   File "/home/background/zopetest/lib/python/App/Product.py", line 46, in ?
    from HelpSys.HelpSys import ProductHelp
   File "/home/background/zopetest/lib/python/HelpSys/__init__.py", line 15, in ?
    import HelpSys
   File "/home/background/zopetest/lib/python/HelpSys/HelpSys.py", line 18, in ?
    from Products.ZCatalog.ZCatalog import ZCatalog
   File "/home/background/zopetest/lib/python/Products/ZCatalog/__init__.py", line 16, in ?
    import ZCatalog, Catalog, CatalogAwareness,  ZClasses
   File "/home/background/zopetest/lib/python/Products/ZCatalog/ZCatalog.py", line 27, in ?
    from Catalog import Catalog, CatalogError
   File "/home/background/zopetest/lib/python/Products/ZCatalog/Catalog.py", line 17, in ?
    from Products.PluginIndexes.TextIndex.Lexicon import Lexicon
   File "/home/background/zopetest/lib/python/Products/PluginIndexes/__init__.py", line 15, in ?
    import common.ResultList     as ResultList
   File "/home/background/zopetest/lib/python/Products/PluginIndexes/common/ResultList.py", line 14, in ?
    from BTrees.IIBTree import IIBucket
   File "/home/background/zopetest/lib/python/BTrees/IIBTree.py", line 16, in ?
    from _IIBTree import *


Module testRanges.py failed to load
exceptions.ImportError: cannot import name Application
  File "utilities/testrunner.py", line 60, in getSuiteFromFile
   File "testRanges.py", line 17, in ?
    from OFS.Application import Application


Module testConflict.py failed to load
exceptions.ImportError: cannot import name OOBTree
  File "utilities/testrunner.py", line 60, in getSuiteFromFile
   File "testConflict.py", line 16, in ?
    from BTrees.OOBTree import OOBTree, OOBucket, OOSet, OOTreeSet


Module testBTrees.py failed to load
exceptions.ImportError: cannot import name OOBTree
  File "utilities/testrunner.py", line 60, in getSuiteFromFile
   File "testBTrees.py", line 17, in ?
    from BTrees.OOBTree import OOBTree, OOBucket, OOSet, OOTreeSet


Module testBTreesUnicode.py failed to load
exceptions.ImportError: cannot import name OOBTree
  File "utilities/testrunner.py", line 60, in getSuiteFromFile
   File "testBTreesUnicode.py", line 18, in ?
    from BTrees.OOBTree import OOBTree


Module test_all.py failed to load
exceptions.AttributeError: 'OFS' module has no attribute 'Application'
  File "utilities/testrunner.py", line 60, in getSuiteFromFile
   File "test_all.py", line 2, in ?
    import Zope
   File "/home/background/zopetest/lib/python/Zope/__init__.py", line 29, in ?
    OFS.Application.import_products()


Module testTimeoutRelated.py failed to load
exceptions.ImportError: cannot import name OOBTree
  File "utilities/testrunner.py", line 60, in getSuiteFromFile
   File "testTimeoutRelated.py", line 11, in ?
    from Products.Transience.Transience import TransientObjectContainer
   File "/home/background/zopetest/lib/python/Products/Transience/__init__.py", line 20, in ?
    import Transience
   File "/home/background/zopetest/lib/python/Products/Transience/Transience.py", line 31, in ?
    from BTrees import OOBTree


Module testTransientObject.py failed to load
exceptions.ImportError: cannot import name TransientObjectContainer
  File "utilities/testrunner.py", line 60, in getSuiteFromFile
   File "testTransientObject.py", line 19, in ?
    from Products.Transience.Transience import TransientObjectContainer


Module testTransientObjectContainer.py failed to load
exceptions.ImportError: cannot import name TransientObjectContainer
  File "utilities/testrunner.py", line 60, in getSuiteFromFile
   File "testTransientObjectContainer.py", line 19, in ?
    from Products.Transience.Transience import TransientObjectContainer,\


Module test_join.py failed to load
exceptions.ImportError: cannot import name ZCatalog
  File "utilities/testrunner.py", line 60, in getSuiteFromFile
   File "test_join.py", line 4, in ?
    from Products.CMFCore.tests.base.testcase import \
   File "/home/background/zopetest/lib/python/Products/CMFCore/__init__.py", line 17, in ?
    import MembershipTool, WorkflowTool, CatalogTool, DiscussionTool
   File "/home/background/zopetest/lib/python/Products/CMFCore/CatalogTool.py", line 23, in ?
    from Products.ZCatalog.ZCatalog import ZCatalog


Module test_Discussions.py failed to load
exceptions.ImportError: cannot import name CatalogTool
  File "utilities/testrunner.py", line 60, in getSuiteFromFile
   File "test_Discussions.py", line 13, in ?
    from Products.CMFCore.CatalogTool import CatalogTool


Module test_MetadataTool.py failed to load
exceptions.AttributeError: 'Products' module has no attribute 'CMFCore'
  File "utilities/testrunner.py", line 60, in getSuiteFromFile
   File "test_MetadataTool.py", line 4, in ?
    from Products.CMFDefault.MetadataTool import \
   File "/home/background/zopetest/lib/python/Products/CMFDefault/__init__.py", line 22, in ?
    import PropertiesTool, MembershipTool, MetadataTool
   File "/home/background/zopetest/lib/python/Products/CMFDefault/MembershipTool.py", line 45, in ?
    class MembershipTool ( Products.CMFCore.MembershipTool.MembershipTool ):


No test suite found in file:
/home/background/zopetest/lib/python/Products/CMFDefault/tests/test_all.py

Module testUnicodeSplitter.py failed to load
exceptions.ImportError: No module named UnicodeSplitter
  File "utilities/testrunner.py", line 60, in getSuiteFromFile
   File "testUnicodeSplitter.py", line 2, in ?
    from Products.PluginIndexes.TextIndex.Splitter.UnicodeSplitter.UnicodeSplitter import UnicodeSplitter
   File "/home/background/zopetest/lib/python/Products/PluginIndexes/TextIndex/Splitter/UnicodeSplitter/__init__.py", line 1, in ?
    from UnicodeSplitter import UnicodeSplitter as Splitter


Module testTextIndex.py failed to load
exceptions.ImportError: cannot import name ResultList
  File "utilities/testrunner.py", line 60, in getSuiteFromFile
   File "testTextIndex.py", line 24, in ?
    from Products.PluginIndexes.TextIndex import TextIndex
   File "/home/background/zopetest/lib/python/Products/PluginIndexes/TextIndex/TextIndex.py", line 27, in ?
    from Products.PluginIndexes.common.ResultList import ResultList


Module testKeywordIndex.py failed to load
exceptions.ImportError: cannot import name OOSet
  File "utilities/testrunner.py", line 60, in getSuiteFromFile
   File "testKeywordIndex.py", line 15, in ?
    from Products.PluginIndexes.KeywordIndex.KeywordIndex import KeywordIndex
   File "/home/background/zopetest/lib/python/Products/PluginIndexes/KeywordIndex/KeywordIndex.py", line 16, in ?
    from BTrees.OOBTree import OOSet, difference


Module testPathIndex.py failed to load
exceptions.ImportError: No module named IOBTree
  File "utilities/testrunner.py", line 60, in getSuiteFromFile
   File "testPathIndex.py", line 16, in ?
    from Products.PluginIndexes.PathIndex.PathIndex import PathIndex
   File "/home/background/zopetest/lib/python/Products/PluginIndexes/PathIndex/PathIndex.py", line 24, in ?
    from BTrees.IOBTree import IOBTree


Module testFieldIndex.py failed to load
exceptions.ImportError: cannot import name OOBTree
  File "utilities/testrunner.py", line 60, in getSuiteFromFile
   File "testFieldIndex.py", line 17, in ?
    from Products.PluginIndexes.FieldIndex.FieldIndex import FieldIndex
   File "/home/background/zopetest/lib/python/Products/PluginIndexes/FieldIndex/FieldIndex.py", line 25, in ?
    from BTrees.OOBTree import OOBTree, OOSet


Module test_IssueDescription.py failed to load
exceptions.ImportError: cannot import name CatalogTool
  File "utilities/testrunner.py", line 60, in getSuiteFromFile
   File "test_IssueDescription.py", line 2, in ?
    from Products.CMFTracker.tests.utils import *
   File "/home/background/zopetest/lib/python/Products/CMFTracker/tests/utils.py", line 5, in ?
    from Products.CMFCore.CatalogTool import CatalogTool


No test suite found in file:
/home/background/zopetest/lib/python/Products/CMFTracker/tests/test_all.py

Module test_CatalogTool.py failed to load
exceptions.ImportError: cannot import name CatalogTool
  File "utilities/testrunner.py", line 60, in getSuiteFromFile
   File "test_CatalogTool.py", line 7, in ?
    from Products.CMFCore.CatalogTool import CatalogTool


Module test_ActionsTool.py failed to load
exceptions.ImportError: cannot import name MembershipTool
  File "utilities/testrunner.py", line 60, in getSuiteFromFile
   File "test_ActionsTool.py", line 12, in ?
    from Products.CMFDefault.MembershipTool import MembershipTool


No test suite found in file:
/home/background/zopetest/lib/python/Products/CMFCore/tests/test_all.py

Module test_PortalFolder.py failed to load
exceptions.ImportError: cannot import name CatalogTool
  File "utilities/testrunner.py", line 60, in getSuiteFromFile
   File "/home/background/zopetest/lib/python/Products/CMFCore/tests/test_PortalFolder.py", line 16, in ?
    from Products.CMFCore.CatalogTool import CatalogTool


Module testCatalog.py failed to load
exceptions.ImportError: cannot import name DemoStorage
  File "utilities/testrunner.py", line 60, in getSuiteFromFile
   File "testCatalog.py", line 8, in ?
    from ZODB.DemoStorage import DemoStorage


Module testSessionDataManager.py failed to load
exceptions.ImportError: cannot import name TransientObjectContainer
  File "utilities/testrunner.py", line 60, in getSuiteFromFile
   File "testSessionDataManager.py", line 25, in ?
    from Products.Transience.Transience import \


FullTest.checkVersionIterator() temporarily disabled.
======================================================================
ERROR: test_BasicHtml (test_NewsItem.NewsItemTests)
----------------------------------------------------------------------
Traceback (most recent call last):
  File "test_NewsItem.py", line 14, in setUp
  File "/home/background/zopetest/lib/python/Products/CMFCore/tests/base/testcase.py", line 23, in setUp
    TransactionalTest.setUp(self)
  File "/home/background/zopetest/lib/python/Products/CMFCore/tests/base/testcase.py", line 13, in setUp
    self.connection = Zope.DB.open()
AttributeError: 'Zope' module has no attribute 'DB'
======================================================================
ERROR: test_Empty (test_NewsItem.NewsItemTests)
----------------------------------------------------------------------
Traceback (most recent call last):
  File "test_NewsItem.py", line 14, in setUp
  File "/home/background/zopetest/lib/python/Products/CMFCore/tests/base/testcase.py", line 23, in setUp
    TransactionalTest.setUp(self)
  File "/home/background/zopetest/lib/python/Products/CMFCore/tests/base/testcase.py", line 13, in setUp
    self.connection = Zope.DB.open()
AttributeError: 'Zope' module has no attribute 'DB'
======================================================================
ERROR: test_EntityInTitle (test_NewsItem.NewsItemTests)
----------------------------------------------------------------------
Traceback (most recent call last):
  File "test_NewsItem.py", line 14, in setUp
  File "/home/background/zopetest/lib/python/Products/CMFCore/tests/base/testcase.py", line 23, in setUp
    TransactionalTest.setUp(self)
  File "/home/background/zopetest/lib/python/Products/CMFCore/tests/base/testcase.py", line 13, in setUp
    self.connection = Zope.DB.open()
AttributeError: 'Zope' module has no attribute 'DB'
======================================================================
ERROR: test_HtmlWithDoctype (test_NewsItem.NewsItemTests)
----------------------------------------------------------------------
Traceback (most recent call last):
  File "test_NewsItem.py", line 14, in setUp
  File "/home/background/zopetest/lib/python/Products/CMFCore/tests/base/testcase.py", line 23, in setUp
    TransactionalTest.setUp(self)
  File "/home/background/zopetest/lib/python/Products/CMFCore/tests/base/testcase.py", line 13, in setUp
    self.connection = Zope.DB.open()
AttributeError: 'Zope' module has no attribute 'DB'
======================================================================
ERROR: test_HtmlWithoutNewlines (test_NewsItem.NewsItemTests)
----------------------------------------------------------------------
Traceback (most recent call last):
  File "test_NewsItem.py", line 14, in setUp
  File "/home/background/zopetest/lib/python/Products/CMFCore/tests/base/testcase.py", line 23, in setUp
    TransactionalTest.setUp(self)
  File "/home/background/zopetest/lib/python/Products/CMFCore/tests/base/testcase.py", line 13, in setUp
    self.connection = Zope.DB.open()
AttributeError: 'Zope' module has no attribute 'DB'
======================================================================
ERROR: test_Init (test_NewsItem.NewsItemTests)
----------------------------------------------------------------------
Traceback (most recent call last):
  File "test_NewsItem.py", line 14, in setUp
  File "/home/background/zopetest/lib/python/Products/CMFCore/tests/base/testcase.py", line 23, in setUp
    TransactionalTest.setUp(self)
  File "/home/background/zopetest/lib/python/Products/CMFCore/tests/base/testcase.py", line 13, in setUp
    self.connection = Zope.DB.open()
AttributeError: 'Zope' module has no attribute 'DB'
======================================================================
ERROR: test_StructuredText (test_NewsItem.NewsItemTests)
----------------------------------------------------------------------
Traceback (most recent call last):
  File "test_NewsItem.py", line 14, in setUp
  File "/home/background/zopetest/lib/python/Products/CMFCore/tests/base/testcase.py", line 23, in setUp
    TransactionalTest.setUp(self)
  File "/home/background/zopetest/lib/python/Products/CMFCore/tests/base/testcase.py", line 13, in setUp
    self.connection = Zope.DB.open()
AttributeError: 'Zope' module has no attribute 'DB'
======================================================================
ERROR: test_UpperedHtml (test_NewsItem.NewsItemTests)
----------------------------------------------------------------------
Traceback (most recent call last):
  File "test_NewsItem.py", line 14, in setUp
  File "/home/background/zopetest/lib/python/Products/CMFCore/tests/base/testcase.py", line 23, in setUp
    TransactionalTest.setUp(self)
  File "/home/background/zopetest/lib/python/Products/CMFCore/tests/base/testcase.py", line 13, in setUp
    self.connection = Zope.DB.open()
AttributeError: 'Zope' module has no attribute 'DB'
======================================================================
ERROR: test_BasicHtmlPUT (test_Document.DocumentTests)
----------------------------------------------------------------------
Traceback (most recent call last):
  File "test_Document.py", line 18, in setUp
  File "/home/background/zopetest/lib/python/Products/CMFCore/tests/base/testcase.py", line 23, in setUp
    TransactionalTest.setUp(self)
  File "/home/background/zopetest/lib/python/Products/CMFCore/tests/base/testcase.py", line 13, in setUp
    self.connection = Zope.DB.open()
AttributeError: 'Zope' module has no attribute 'DB'
======================================================================
ERROR: test_BigHtml (test_Document.DocumentTests)
----------------------------------------------------------------------
Traceback (most recent call last):
  File "test_Document.py", line 18, in setUp
  File "/home/background/zopetest/lib/python/Products/CMFCore/tests/base/testcase.py", line 23, in setUp
    TransactionalTest.setUp(self)
  File "/home/background/zopetest/lib/python/Products/CMFCore/tests/base/testcase.py", line 13, in setUp
    self.connection = Zope.DB.open()
AttributeError: 'Zope' module has no attribute 'DB'
======================================================================
ERROR: test_BigHtml_via_upload (test_Document.DocumentTests)
----------------------------------------------------------------------
Traceback (most recent call last):
  File "test_Document.py", line 18, in setUp
  File "/home/background/zopetest/lib/python/Products/CMFCore/tests/base/testcase.py", line 23, in setUp
    TransactionalTest.setUp(self)
  File "/home/background/zopetest/lib/python/Products/CMFCore/tests/base/testcase.py", line 13, in setUp
    self.connection = Zope.DB.open()
AttributeError: 'Zope' module has no attribute 'DB'
======================================================================
ERROR: test_EditStructuredTextWithHTML (test_Document.DocumentTests)
----------------------------------------------------------------------
Traceback (most recent call last):
  File "test_Document.py", line 18, in setUp
  File "/home/background/zopetest/lib/python/Products/CMFCore/tests/base/testcase.py", line 23, in setUp
    TransactionalTest.setUp(self)
  File "/home/background/zopetest/lib/python/Products/CMFCore/tests/base/testcase.py", line 13, in setUp
    self.connection = Zope.DB.open()
AttributeError: 'Zope' module has no attribute 'DB'
======================================================================
ERROR: test_Empty (test_Document.DocumentTests)
----------------------------------------------------------------------
Traceback (most recent call last):
  File "test_Document.py", line 18, in setUp
  File "/home/background/zopetest/lib/python/Products/CMFCore/tests/base/testcase.py", line 23, in setUp
    TransactionalTest.setUp(self)
  File "/home/background/zopetest/lib/python/Products/CMFCore/tests/base/testcase.py", line 13, in setUp
    self.connection = Zope.DB.open()
AttributeError: 'Zope' module has no attribute 'DB'
======================================================================
ERROR: test_EntityInTitle (test_Document.DocumentTests)
----------------------------------------------------------------------
Traceback (most recent call last):
  File "test_Document.py", line 18, in setUp
  File "/home/background/zopetest/lib/python/Products/CMFCore/tests/base/testcase.py", line 23, in setUp
    TransactionalTest.setUp(self)
  File "/home/background/zopetest/lib/python/Products/CMFCore/tests/base/testcase.py", line 13, in setUp
    self.connection = Zope.DB.open()
AttributeError: 'Zope' module has no attribute 'DB'
======================================================================
ERROR: test_HtmlWithDoctype (test_Document.DocumentTests)
----------------------------------------------------------------------
Traceback (most recent call last):
  File "test_Document.py", line 18, in setUp
  File "/home/background/zopetest/lib/python/Products/CMFCore/tests/base/testcase.py", line 23, in setUp
    TransactionalTest.setUp(self)
  File "/home/background/zopetest/lib/python/Products/CMFCore/tests/base/testcase.py", line 13, in setUp
    self.connection = Zope.DB.open()
AttributeError: 'Zope' module has no attribute 'DB'
======================================================================
ERROR: test_HtmlWithoutNewlines (test_Document.DocumentTests)
----------------------------------------------------------------------
Traceback (most recent call last):
  File "test_Document.py", line 18, in setUp
  File "/home/background/zopetest/lib/python/Products/CMFCore/tests/base/testcase.py", line 23, in setUp
    TransactionalTest.setUp(self)
  File "/home/background/zopetest/lib/python/Products/CMFCore/tests/base/testcase.py", line 13, in setUp
    self.connection = Zope.DB.open()
AttributeError: 'Zope' module has no attribute 'DB'
======================================================================
ERROR: test_Init (test_Document.DocumentTests)
----------------------------------------------------------------------
Traceback (most recent call last):
  File "test_Document.py", line 18, in setUp
  File "/home/background/zopetest/lib/python/Products/CMFCore/tests/base/testcase.py", line 23, in setUp
    TransactionalTest.setUp(self)
  File "/home/background/zopetest/lib/python/Products/CMFCore/tests/base/testcase.py", line 13, in setUp
    self.connection = Zope.DB.open()
AttributeError: 'Zope' module has no attribute 'DB'
======================================================================
ERROR: test_STX_Levels (test_Document.DocumentTests)
----------------------------------------------------------------------
Traceback (most recent call last):
  File "test_Document.py", line 18, in setUp
  File "/home/background/zopetest/lib/python/Products/CMFCore/tests/base/testcase.py", line 23, in setUp
    TransactionalTest.setUp(self)
  File "/home/background/zopetest/lib/python/Products/CMFCore/tests/base/testcase.py", line 13, in setUp
    self.connection = Zope.DB.open()
AttributeError: 'Zope' module has no attribute 'DB'
======================================================================
ERROR: test_STX_NoHeaders (test_Document.DocumentTests)
----------------------------------------------------------------------
Traceback (most recent call last):
  File "test_Document.py", line 18, in setUp
  File "/home/background/zopetest/lib/python/Products/CMFCore/tests/base/testcase.py", line 23, in setUp
    TransactionalTest.setUp(self)
  File "/home/background/zopetest/lib/python/Products/CMFCore/tests/base/testcase.py", line 13, in setUp
    self.connection = Zope.DB.open()
AttributeError: 'Zope' module has no attribute 'DB'
======================================================================
ERROR: test_STX_NoHeaders_but_colon (test_Document.DocumentTests)
----------------------------------------------------------------------
Traceback (most recent call last):
  File "test_Document.py", line 18, in setUp
  File "/home/background/zopetest/lib/python/Products/CMFCore/tests/base/testcase.py", line 23, in setUp
    TransactionalTest.setUp(self)
  File "/home/background/zopetest/lib/python/Products/CMFCore/tests/base/testcase.py", line 13, in setUp
    self.connection = Zope.DB.open()
AttributeError: 'Zope' module has no attribute 'DB'
======================================================================
ERROR: test_StructuredText (test_Document.DocumentTests)
----------------------------------------------------------------------
Traceback (most recent call last):
  File "test_Document.py", line 18, in setUp
  File "/home/background/zopetest/lib/python/Products/CMFCore/tests/base/testcase.py", line 23, in setUp
    TransactionalTest.setUp(self)
  File "/home/background/zopetest/lib/python/Products/CMFCore/tests/base/testcase.py", line 13, in setUp
    self.connection = Zope.DB.open()
AttributeError: 'Zope' module has no attribute 'DB'
======================================================================
ERROR: test_UpperedHtml (test_Document.DocumentTests)
----------------------------------------------------------------------
Traceback (most recent call last):
  File "test_Document.py", line 18, in setUp
  File "/home/background/zopetest/lib/python/Products/CMFCore/tests/base/testcase.py", line 23, in setUp
    TransactionalTest.setUp(self)
  File "/home/background/zopetest/lib/python/Products/CMFCore/tests/base/testcase.py", line 13, in setUp
    self.connection = Zope.DB.open()
AttributeError: 'Zope' module has no attribute 'DB'
======================================================================
ERROR: test_ZMI_edit (test_Document.DocumentTests)
----------------------------------------------------------------------
Traceback (most recent call last):
  File "test_Document.py", line 18, in setUp
  File "/home/background/zopetest/lib/python/Products/CMFCore/tests/base/testcase.py", line 23, in setUp
    TransactionalTest.setUp(self)
  File "/home/background/zopetest/lib/python/Products/CMFCore/tests/base/testcase.py", line 13, in setUp
    self.connection = Zope.DB.open()
AttributeError: 'Zope' module has no attribute 'DB'
======================================================================
ERROR: testHTML (test_Document.TestFTPGet)
----------------------------------------------------------------------
Traceback (most recent call last):
  File "/home/background/zopetest/lib/python/Products/CMFCore/tests/base/testcase.py", line 23, in setUp
    TransactionalTest.setUp(self)
  File "/home/background/zopetest/lib/python/Products/CMFCore/tests/base/testcase.py", line 13, in setUp
    self.connection = Zope.DB.open()
AttributeError: 'Zope' module has no attribute 'DB'
======================================================================
ERROR: testSTX (test_Document.TestFTPGet)
----------------------------------------------------------------------
Traceback (most recent call last):
  File "/home/background/zopetest/lib/python/Products/CMFCore/tests/base/testcase.py", line 23, in setUp
    TransactionalTest.setUp(self)
  File "/home/background/zopetest/lib/python/Products/CMFCore/tests/base/testcase.py", line 13, in setUp
    self.connection = Zope.DB.open()
AttributeError: 'Zope' module has no attribute 'DB'
======================================================================
ERROR: test_PutHtml (test_Document.TestDocumentPUT)
----------------------------------------------------------------------
Traceback (most recent call last):
  File "test_Document.py", line 316, in setUp
  File "/home/background/zopetest/lib/python/Products/CMFCore/tests/base/testcase.py", line 23, in setUp
    TransactionalTest.setUp(self)
  File "/home/background/zopetest/lib/python/Products/CMFCore/tests/base/testcase.py", line 13, in setUp
    self.connection = Zope.DB.open()
AttributeError: 'Zope' module has no attribute 'DB'
======================================================================
ERROR: test_PutHtmlWithDoctype (test_Document.TestDocumentPUT)
----------------------------------------------------------------------
Traceback (most recent call last):
  File "test_Document.py", line 316, in setUp
  File "/home/background/zopetest/lib/python/Products/CMFCore/tests/base/testcase.py", line 23, in setUp
    TransactionalTest.setUp(self)
  File "/home/background/zopetest/lib/python/Products/CMFCore/tests/base/testcase.py", line 13, in setUp
    self.connection = Zope.DB.open()
AttributeError: 'Zope' module has no attribute 'DB'
======================================================================
ERROR: test_PutStructuredText (test_Document.TestDocumentPUT)
----------------------------------------------------------------------
Traceback (most recent call last):
  File "test_Document.py", line 316, in setUp
  File "/home/background/zopetest/lib/python/Products/CMFCore/tests/base/testcase.py", line 23, in setUp
    TransactionalTest.setUp(self)
  File "/home/background/zopetest/lib/python/Products/CMFCore/tests/base/testcase.py", line 13, in setUp
    self.connection = Zope.DB.open()
AttributeError: 'Zope' module has no attribute 'DB'
======================================================================
ERROR: test_PutStructuredTextWithHTML (test_Document.TestDocumentPUT)
----------------------------------------------------------------------
Traceback (most recent call last):
  File "test_Document.py", line 316, in setUp
  File "/home/background/zopetest/lib/python/Products/CMFCore/tests/base/testcase.py", line 23, in setUp
    TransactionalTest.setUp(self)
  File "/home/background/zopetest/lib/python/Products/CMFCore/tests/base/testcase.py", line 13, in setUp
    self.connection = Zope.DB.open()
AttributeError: 'Zope' module has no attribute 'DB'
======================================================================
ERROR: test ISOSplitter
----------------------------------------------------------------------
Traceback (most recent call last):
  File "testSplitter.py", line 67, in testISOSplitter
  File "testSplitter.py", line 52, in _test
  File "/home/background/zopetest/lib/python/Products/PluginIndexes/TextIndex/Splitter/__init__.py", line 31, in getSplitter
    exec( "from %s import Splitter as %s" % (name,name))
  File "<string>", line 1, in ?
  File "/home/background/zopetest/lib/python/Products/PluginIndexes/TextIndex/Splitter/ISO_8859_1_Splitter/__init__.py", line 1, in ?
    from ISO_8859_1_Splitter import ISO_8859_1_Splitter
ImportError: No module named ISO_8859_1_Splitter
======================================================================
ERROR: test_AddingOtherTypeInfos (test_TypesTool.TypesToolTests)
----------------------------------------------------------------------
Traceback (most recent call last):
  File "test_TypesTool.py", line 30, in setUp
  File "/home/background/zopetest/lib/python/Products/CMFCore/tests/base/testcase.py", line 48, in setUp
    SecurityTest.setUp(self)
  File "/home/background/zopetest/lib/python/Products/CMFCore/tests/base/testcase.py", line 35, in setUp
    self.connection = Zope.DB.open()
AttributeError: 'Zope' module has no attribute 'DB'
======================================================================
ERROR: test_allMetaTypes (test_TypesTool.TypesToolTests)
----------------------------------------------------------------------
Traceback (most recent call last):
  File "test_TypesTool.py", line 30, in setUp
  File "/home/background/zopetest/lib/python/Products/CMFCore/tests/base/testcase.py", line 48, in setUp
    SecurityTest.setUp(self)
  File "/home/background/zopetest/lib/python/Products/CMFCore/tests/base/testcase.py", line 35, in setUp
    self.connection = Zope.DB.open()
AttributeError: 'Zope' module has no attribute 'DB'
======================================================================
ERROR: test_processActions (test_TypesTool.TypesToolTests)
----------------------------------------------------------------------
Traceback (most recent call last):
  File "test_TypesTool.py", line 30, in setUp
  File "/home/background/zopetest/lib/python/Products/CMFCore/tests/base/testcase.py", line 48, in setUp
    SecurityTest.setUp(self)
  File "/home/background/zopetest/lib/python/Products/CMFCore/tests/base/testcase.py", line 35, in setUp
    self.connection = Zope.DB.open()
AttributeError: 'Zope' module has no attribute 'DB'
======================================================================
ERROR: test_anonymous_ec (test_Expression.ExpressionTests)
----------------------------------------------------------------------
Traceback (most recent call last):
  File "test_Expression.py", line 17, in setUp
  File "/home/background/zopetest/lib/python/Products/CMFCore/tests/base/testcase.py", line 35, in setUp
    self.connection = Zope.DB.open()
AttributeError: 'Zope' module has no attribute 'DB'
======================================================================
ERROR: test_authenticatedUser_ec (test_Expression.ExpressionTests)
----------------------------------------------------------------------
Traceback (most recent call last):
  File "test_Expression.py", line 17, in setUp
  File "/home/background/zopetest/lib/python/Products/CMFCore/tests/base/testcase.py", line 35, in setUp
    self.connection = Zope.DB.open()
AttributeError: 'Zope' module has no attribute 'DB'
======================================================================
ERROR: test_ec_context (test_Expression.ExpressionTests)
----------------------------------------------------------------------
Traceback (most recent call last):
  File "test_Expression.py", line 17, in setUp
  File "/home/background/zopetest/lib/python/Products/CMFCore/tests/base/testcase.py", line 35, in setUp
    self.connection = Zope.DB.open()
AttributeError: 'Zope' module has no attribute 'DB'
======================================================================
ERROR: test_BadCall (test_FSPageTemplate.FSPageTemplateTests)
----------------------------------------------------------------------
Traceback (most recent call last):
  File "test_FSPageTemplate.py", line 24, in test_BadCall
AttributeError: 'Zope' module has no attribute 'app'
======================================================================
ERROR: test_Call (test_FSPageTemplate.FSPageTemplateTests)
----------------------------------------------------------------------
Traceback (most recent call last):
  File "test_FSPageTemplate.py", line 15, in test_Call
AttributeError: 'Zope' module has no attribute 'app'
======================================================================
ERROR: test_Condition (test_ActionInformation.ActionInformationTests)
----------------------------------------------------------------------
Traceback (most recent call last):
  File "test_ActionInformation.py", line 17, in setUp
  File "/home/background/zopetest/lib/python/Products/CMFCore/tests/base/testcase.py", line 13, in setUp
    self.connection = Zope.DB.open()
AttributeError: 'Zope' module has no attribute 'DB'
======================================================================
ERROR: test_basic_construction (test_ActionInformation.ActionInformationTests)
----------------------------------------------------------------------
Traceback (most recent call last):
  File "test_ActionInformation.py", line 17, in setUp
  File "/home/background/zopetest/lib/python/Products/CMFCore/tests/base/testcase.py", line 13, in setUp
    self.connection = Zope.DB.open()
AttributeError: 'Zope' module has no attribute 'DB'
======================================================================
ERROR: test_construction_with_Expressions (test_ActionInformation.ActionInformationTests)
----------------------------------------------------------------------
Traceback (most recent call last):
  File "test_ActionInformation.py", line 17, in setUp
  File "/home/background/zopetest/lib/python/Products/CMFCore/tests/base/testcase.py", line 13, in setUp
    self.connection = Zope.DB.open()
AttributeError: 'Zope' module has no attribute 'DB'
======================================================================
FAIL: test_isConstructionAllowed_wo_Security (test_TypesTool.FTIConstructionTests)
----------------------------------------------------------------------
Traceback (most recent call last):
  File "test_TypesTool.py", line 342, in test_isConstructionAllowed_wo_Security
  File "/usr/lib/python2.1/unittest.py", line 245, in failIf
    if expr: raise self.failureException, msg
AssertionError
======================================================================
FAIL: test_constructInstance_wo_Roles (test_TypesTool.FTIConstructionTests_w_Roles)
----------------------------------------------------------------------
Traceback (most recent call last):
  File "test_TypesTool.py", line 393, in test_constructInstance_wo_Roles
  File "/usr/lib/python2.1/unittest.py", line 266, in failUnlessRaises
    raise self.failureException, excName
AssertionError: Unauthorized
======================================================================
FAIL: test_isConstructionAllowed_wo_Role (test_TypesTool.FTIConstructionTests_w_Roles)
----------------------------------------------------------------------
Traceback (most recent call last):
  File "test_TypesTool.py", line 383, in test_isConstructionAllowed_wo_Role
  File "/usr/lib/python2.1/unittest.py", line 266, in failUnlessRaises
    raise self.failureException, excName
AssertionError: Unauthorized
----------------------------------------------------------------------
Ran 850 tests in 113.482s

FAILED (failures=3, errors=41)

======================================================================
OVERALL FAILED (total failures=3, total errors=41)

**********************************************************************
Zope 2.5 branch
**********************************************************************
Module testDemoStorage.py failed to load
exceptions.ImportError: No module named _OOBTree
  File "utilities/testrunner.py", line 60, in getSuiteFromFile
   File "testDemoStorage.py", line 1, in ?
    import ZODB.DemoStorage
   File "/home/background/zopetest/lib/python/ZODB/DemoStorage.py", line 88, in ?
    from BTrees import OOBTree
   File "/home/background/zopetest/lib/python/BTrees/OOBTree.py", line 16, in ?
    from _OOBTree import *


Module testfsIndex.py failed to load
exceptions.ImportError: cannot import name fsIndex
  File "utilities/testrunner.py", line 60, in getSuiteFromFile
   File "testfsIndex.py", line 3, in ?
    from ZODB.fsIndex import fsIndex


Module testCopySupport.py failed to load
exceptions.ImportError: No module named _IIBTree
  File "utilities/testrunner.py", line 60, in getSuiteFromFile
   File "testCopySupport.py", line 5, in ?
    from OFS.Application import Application
   File "/home/background/zopetest/lib/python/OFS/Application.py", line 18, in ?
    import Globals,Folder,os,sys,App.Product, App.ProductRegistry, misc_
   File "/home/background/zopetest/lib/python/App/Product.py", line 46, in ?
    from HelpSys.HelpSys import ProductHelp
   File "/home/background/zopetest/lib/python/HelpSys/__init__.py", line 15, in ?
    import HelpSys
   File "/home/background/zopetest/lib/python/HelpSys/HelpSys.py", line 18, in ?
    from Products.ZCatalog.ZCatalog import ZCatalog
   File "/home/background/zopetest/lib/python/Products/ZCatalog/__init__.py", line 16, in ?
    import ZCatalog, Catalog, CatalogAwareness,  ZClasses
   File "/home/background/zopetest/lib/python/Products/ZCatalog/ZCatalog.py", line 27, in ?
    from Catalog import Catalog, CatalogError
   File "/home/background/zopetest/lib/python/Products/ZCatalog/Catalog.py", line 17, in ?
    from Products.PluginIndexes.TextIndex.Lexicon import Lexicon
   File "/home/background/zopetest/lib/python/Products/PluginIndexes/__init__.py", line 15, in ?
    import common.ResultList     as ResultList
   File "/home/background/zopetest/lib/python/Products/PluginIndexes/common/ResultList.py", line 14, in ?
    from BTrees.IIBTree import IIBucket
   File "/home/background/zopetest/lib/python/BTrees/IIBTree.py", line 16, in ?
    from _IIBTree import *


Module testRanges.py failed to load
exceptions.ImportError: cannot import name Application
  File "utilities/testrunner.py", line 60, in getSuiteFromFile
   File "testRanges.py", line 17, in ?
    from OFS.Application import Application


Module testConflict.py failed to load
exceptions.ImportError: cannot import name OOBTree
  File "utilities/testrunner.py", line 60, in getSuiteFromFile
   File "testConflict.py", line 16, in ?
    from BTrees.OOBTree import OOBTree, OOBucket, OOSet, OOTreeSet


Module testBTrees.py failed to load
exceptions.ImportError: cannot import name OOBTree
  File "utilities/testrunner.py", line 60, in getSuiteFromFile
   File "testBTrees.py", line 17, in ?
    from BTrees.OOBTree import OOBTree, OOBucket, OOSet, OOTreeSet


Module testBTreesUnicode.py failed to load
exceptions.ImportError: cannot import name OOBTree
  File "utilities/testrunner.py", line 60, in getSuiteFromFile
   File "testBTreesUnicode.py", line 18, in ?
    from BTrees.OOBTree import OOBTree


Module test_all.py failed to load
exceptions.AttributeError: 'OFS' module has no attribute 'Application'
  File "utilities/testrunner.py", line 60, in getSuiteFromFile
   File "test_all.py", line 2, in ?
    import Zope
   File "/home/background/zopetest/lib/python/Zope/__init__.py", line 29, in ?
    OFS.Application.import_products()


Module testTimeoutRelated.py failed to load
exceptions.ImportError: cannot import name OOBTree
  File "utilities/testrunner.py", line 60, in getSuiteFromFile
   File "testTimeoutRelated.py", line 11, in ?
    from Products.Transience.Transience import TransientObjectContainer
   File "/home/background/zopetest/lib/python/Products/Transience/__init__.py", line 20, in ?
    import Transience
   File "/home/background/zopetest/lib/python/Products/Transience/Transience.py", line 31, in ?
    from BTrees import OOBTree


Module testTransientObject.py failed to load
exceptions.ImportError: cannot import name TransientObjectContainer
  File "utilities/testrunner.py", line 60, in getSuiteFromFile
   File "testTransientObject.py", line 19, in ?
    from Products.Transience.Transience import TransientObjectContainer


Module testTransientObjectContainer.py failed to load
exceptions.ImportError: cannot import name TransientObjectContainer
  File "utilities/testrunner.py", line 60, in getSuiteFromFile
   File "testTransientObjectContainer.py", line 19, in ?
    from Products.Transience.Transience import TransientObjectContainer,\


Module test_join.py failed to load
exceptions.ImportError: cannot import name ZCatalog
  File "utilities/testrunner.py", line 60, in getSuiteFromFile
   File "test_join.py", line 4, in ?
    from Products.CMFCore.tests.base.testcase import \
   File "/home/background/zopetest/lib/python/Products/CMFCore/__init__.py", line 17, in ?
    import MembershipTool, WorkflowTool, CatalogTool, DiscussionTool
   File "/home/background/zopetest/lib/python/Products/CMFCore/CatalogTool.py", line 23, in ?
    from Products.ZCatalog.ZCatalog import ZCatalog


Module test_Discussions.py failed to load
exceptions.ImportError: cannot import name CatalogTool
  File "utilities/testrunner.py", line 60, in getSuiteFromFile
   File "test_Discussions.py", line 13, in ?
    from Products.CMFCore.CatalogTool import CatalogTool


Module test_MetadataTool.py failed to load
exceptions.AttributeError: 'Products' module has no attribute 'CMFCore'
  File "utilities/testrunner.py", line 60, in getSuiteFromFile
   File "test_MetadataTool.py", line 4, in ?
    from Products.CMFDefault.MetadataTool import \
   File "/home/background/zopetest/lib/python/Products/CMFDefault/__init__.py", line 22, in ?
    import PropertiesTool, MembershipTool, MetadataTool
   File "/home/background/zopetest/lib/python/Products/CMFDefault/MembershipTool.py", line 45, in ?
    class MembershipTool ( Products.CMFCore.MembershipTool.MembershipTool ):


No test suite found in file:
/home/background/zopetest/lib/python/Products/CMFDefault/tests/test_all.py

Module testUnicodeSplitter.py failed to load
exceptions.ImportError: No module named UnicodeSplitter
  File "utilities/testrunner.py", line 60, in getSuiteFromFile
   File "testUnicodeSplitter.py", line 2, in ?
    from Products.PluginIndexes.TextIndex.Splitter.UnicodeSplitter.UnicodeSplitter import UnicodeSplitter
   File "/home/background/zopetest/lib/python/Products/PluginIndexes/TextIndex/Splitter/UnicodeSplitter/__init__.py", line 1, in ?
    from UnicodeSplitter import UnicodeSplitter as Splitter


Module testTextIndex.py failed to load
exceptions.ImportError: cannot import name ResultList
  File "utilities/testrunner.py", line 60, in getSuiteFromFile
   File "testTextIndex.py", line 24, in ?
    from Products.PluginIndexes.TextIndex import TextIndex
   File "/home/background/zopetest/lib/python/Products/PluginIndexes/TextIndex/TextIndex.py", line 27, in ?
    from Products.PluginIndexes.common.ResultList import ResultList


Module testKeywordIndex.py failed to load
exceptions.ImportError: cannot import name OOSet
  File "utilities/testrunner.py", line 60, in getSuiteFromFile
   File "testKeywordIndex.py", line 15, in ?
    from Products.PluginIndexes.KeywordIndex.KeywordIndex import KeywordIndex
   File "/home/background/zopetest/lib/python/Products/PluginIndexes/KeywordIndex/KeywordIndex.py", line 16, in ?
    from BTrees.OOBTree import OOSet, difference


Module testPathIndex.py failed to load
exceptions.ImportError: No module named IOBTree
  File "utilities/testrunner.py", line 60, in getSuiteFromFile
   File "testPathIndex.py", line 16, in ?
    from Products.PluginIndexes.PathIndex.PathIndex import PathIndex
   File "/home/background/zopetest/lib/python/Products/PluginIndexes/PathIndex/PathIndex.py", line 24, in ?
    from BTrees.IOBTree import IOBTree


Module testFieldIndex.py failed to load
exceptions.ImportError: cannot import name OOBTree
  File "utilities/testrunner.py", line 60, in getSuiteFromFile
   File "testFieldIndex.py", line 17, in ?
    from Products.PluginIndexes.FieldIndex.FieldIndex import FieldIndex
   File "/home/background/zopetest/lib/python/Products/PluginIndexes/FieldIndex/FieldIndex.py", line 25, in ?
    from BTrees.OOBTree import OOBTree, OOSet


Module test_IssueDescription.py failed to load
exceptions.ImportError: cannot import name CatalogTool
  File "utilities/testrunner.py", line 60, in getSuiteFromFile
   File "test_IssueDescription.py", line 2, in ?
    from Products.CMFTracker.tests.utils import *
   File "/home/background/zopetest/lib/python/Products/CMFTracker/tests/utils.py", line 5, in ?
    from Products.CMFCore.CatalogTool import CatalogTool


No test suite found in file:
/home/background/zopetest/lib/python/Products/CMFTracker/tests/test_all.py

Module test_CatalogTool.py failed to load
exceptions.ImportError: cannot import name CatalogTool
  File "utilities/testrunner.py", line 60, in getSuiteFromFile
   File "test_CatalogTool.py", line 7, in ?
    from Products.CMFCore.CatalogTool import CatalogTool


Module test_ActionsTool.py failed to load
exceptions.ImportError: cannot import name MembershipTool
  File "utilities/testrunner.py", line 60, in getSuiteFromFile
   File "test_ActionsTool.py", line 12, in ?
    from Products.CMFDefault.MembershipTool import MembershipTool


No test suite found in file:
/home/background/zopetest/lib/python/Products/CMFCore/tests/test_all.py

Module test_PortalFolder.py failed to load
exceptions.ImportError: cannot import name CatalogTool
  File "utilities/testrunner.py", line 60, in getSuiteFromFile
   File "/home/background/zopetest/lib/python/Products/CMFCore/tests/test_PortalFolder.py", line 16, in ?
    from Products.CMFCore.CatalogTool import CatalogTool


Module testCatalog.py failed to load
exceptions.ImportError: cannot import name DemoStorage
  File "utilities/testrunner.py", line 60, in getSuiteFromFile
   File "testCatalog.py", line 8, in ?
    from ZODB.DemoStorage import DemoStorage


Module testSessionDataManager.py failed to load
exceptions.ImportError: cannot import name TransientObjectContainer
  File "utilities/testrunner.py", line 60, in getSuiteFromFile
   File "testSessionDataManager.py", line 25, in ?
    from Products.Transience.Transience import \


FullTest.checkVersionIterator() temporarily disabled.
======================================================================
ERROR: test_BasicHtml (test_NewsItem.NewsItemTests)
----------------------------------------------------------------------
Traceback (most recent call last):
  File "test_NewsItem.py", line 14, in setUp
  File "/home/background/zopetest/lib/python/Products/CMFCore/tests/base/testcase.py", line 23, in setUp
    TransactionalTest.setUp(self)
  File "/home/background/zopetest/lib/python/Products/CMFCore/tests/base/testcase.py", line 13, in setUp
    self.connection = Zope.DB.open()
AttributeError: 'Zope' module has no attribute 'DB'
======================================================================
ERROR: test_Empty (test_NewsItem.NewsItemTests)
----------------------------------------------------------------------
Traceback (most recent call last):
  File "test_NewsItem.py", line 14, in setUp
  File "/home/background/zopetest/lib/python/Products/CMFCore/tests/base/testcase.py", line 23, in setUp
    TransactionalTest.setUp(self)
  File "/home/background/zopetest/lib/python/Products/CMFCore/tests/base/testcase.py", line 13, in setUp
    self.connection = Zope.DB.open()
AttributeError: 'Zope' module has no attribute 'DB'
======================================================================
ERROR: test_EntityInTitle (test_NewsItem.NewsItemTests)
----------------------------------------------------------------------
Traceback (most recent call last):
  File "test_NewsItem.py", line 14, in setUp
  File "/home/background/zopetest/lib/python/Products/CMFCore/tests/base/testcase.py", line 23, in setUp
    TransactionalTest.setUp(self)
  File "/home/background/zopetest/lib/python/Products/CMFCore/tests/base/testcase.py", line 13, in setUp
    self.connection = Zope.DB.open()
AttributeError: 'Zope' module has no attribute 'DB'
======================================================================
ERROR: test_HtmlWithDoctype (test_NewsItem.NewsItemTests)
----------------------------------------------------------------------
Traceback (most recent call last):
  File "test_NewsItem.py", line 14, in setUp
  File "/home/background/zopetest/lib/python/Products/CMFCore/tests/base/testcase.py", line 23, in setUp
    TransactionalTest.setUp(self)
  File "/home/background/zopetest/lib/python/Products/CMFCore/tests/base/testcase.py", line 13, in setUp
    self.connection = Zope.DB.open()
AttributeError: 'Zope' module has no attribute 'DB'
======================================================================
ERROR: test_HtmlWithoutNewlines (test_NewsItem.NewsItemTests)
----------------------------------------------------------------------
Traceback (most recent call last):
  File "test_NewsItem.py", line 14, in setUp
  File "/home/background/zopetest/lib/python/Products/CMFCore/tests/base/testcase.py", line 23, in setUp
    TransactionalTest.setUp(self)
  File "/home/background/zopetest/lib/python/Products/CMFCore/tests/base/testcase.py", line 13, in setUp
    self.connection = Zope.DB.open()
AttributeError: 'Zope' module has no attribute 'DB'
======================================================================
ERROR: test_Init (test_NewsItem.NewsItemTests)
----------------------------------------------------------------------
Traceback (most recent call last):
  File "test_NewsItem.py", line 14, in setUp
  File "/home/background/zopetest/lib/python/Products/CMFCore/tests/base/testcase.py", line 23, in setUp
    TransactionalTest.setUp(self)
  File "/home/background/zopetest/lib/python/Products/CMFCore/tests/base/testcase.py", line 13, in setUp
    self.connection = Zope.DB.open()
AttributeError: 'Zope' module has no attribute 'DB'
======================================================================
ERROR: test_StructuredText (test_NewsItem.NewsItemTests)
----------------------------------------------------------------------
Traceback (most recent call last):
  File "test_NewsItem.py", line 14, in setUp
  File "/home/background/zopetest/lib/python/Products/CMFCore/tests/base/testcase.py", line 23, in setUp
    TransactionalTest.setUp(self)
  File "/home/background/zopetest/lib/python/Products/CMFCore/tests/base/testcase.py", line 13, in setUp
    self.connection = Zope.DB.open()
AttributeError: 'Zope' module has no attribute 'DB'
======================================================================
ERROR: test_UpperedHtml (test_NewsItem.NewsItemTests)
----------------------------------------------------------------------
Traceback (most recent call last):
  File "test_NewsItem.py", line 14, in setUp
  File "/home/background/zopetest/lib/python/Products/CMFCore/tests/base/testcase.py", line 23, in setUp
    TransactionalTest.setUp(self)
  File "/home/background/zopetest/lib/python/Products/CMFCore/tests/base/testcase.py", line 13, in setUp
    self.connection = Zope.DB.open()
AttributeError: 'Zope' module has no attribute 'DB'
======================================================================
ERROR: test_BasicHtmlPUT (test_Document.DocumentTests)
----------------------------------------------------------------------
Traceback (most recent call last):
  File "test_Document.py", line 18, in setUp
  File "/home/background/zopetest/lib/python/Products/CMFCore/tests/base/testcase.py", line 23, in setUp
    TransactionalTest.setUp(self)
  File "/home/background/zopetest/lib/python/Products/CMFCore/tests/base/testcase.py", line 13, in setUp
    self.connection = Zope.DB.open()
AttributeError: 'Zope' module has no attribute 'DB'
======================================================================
ERROR: test_BigHtml (test_Document.DocumentTests)
----------------------------------------------------------------------
Traceback (most recent call last):
  File "test_Document.py", line 18, in setUp
  File "/home/background/zopetest/lib/python/Products/CMFCore/tests/base/testcase.py", line 23, in setUp
    TransactionalTest.setUp(self)
  File "/home/background/zopetest/lib/python/Products/CMFCore/tests/base/testcase.py", line 13, in setUp
    self.connection = Zope.DB.open()
AttributeError: 'Zope' module has no attribute 'DB'
======================================================================
ERROR: test_BigHtml_via_upload (test_Document.DocumentTests)
----------------------------------------------------------------------
Traceback (most recent call last):
  File "test_Document.py", line 18, in setUp
  File "/home/background/zopetest/lib/python/Products/CMFCore/tests/base/testcase.py", line 23, in setUp
    TransactionalTest.setUp(self)
  File "/home/background/zopetest/lib/python/Products/CMFCore/tests/base/testcase.py", line 13, in setUp
    self.connection = Zope.DB.open()
AttributeError: 'Zope' module has no attribute 'DB'
======================================================================
ERROR: test_EditStructuredTextWithHTML (test_Document.DocumentTests)
----------------------------------------------------------------------
Traceback (most recent call last):
  File "test_Document.py", line 18, in setUp
  File "/home/background/zopetest/lib/python/Products/CMFCore/tests/base/testcase.py", line 23, in setUp
    TransactionalTest.setUp(self)
  File "/home/background/zopetest/lib/python/Products/CMFCore/tests/base/testcase.py", line 13, in setUp
    self.connection = Zope.DB.open()
AttributeError: 'Zope' module has no attribute 'DB'
======================================================================
ERROR: test_Empty (test_Document.DocumentTests)
----------------------------------------------------------------------
Traceback (most recent call last):
  File "test_Document.py", line 18, in setUp
  File "/home/background/zopetest/lib/python/Products/CMFCore/tests/base/testcase.py", line 23, in setUp
    TransactionalTest.setUp(self)
  File "/home/background/zopetest/lib/python/Products/CMFCore/tests/base/testcase.py", line 13, in setUp
    self.connection = Zope.DB.open()
AttributeError: 'Zope' module has no attribute 'DB'
======================================================================
ERROR: test_EntityInTitle (test_Document.DocumentTests)
----------------------------------------------------------------------
Traceback (most recent call last):
  File "test_Document.py", line 18, in setUp
  File "/home/background/zopetest/lib/python/Products/CMFCore/tests/base/testcase.py", line 23, in setUp
    TransactionalTest.setUp(self)
  File "/home/background/zopetest/lib/python/Products/CMFCore/tests/base/testcase.py", line 13, in setUp
    self.connection = Zope.DB.open()
AttributeError: 'Zope' module has no attribute 'DB'
======================================================================
ERROR: test_HtmlWithDoctype (test_Document.DocumentTests)
----------------------------------------------------------------------
Traceback (most recent call last):
  File "test_Document.py", line 18, in setUp
  File "/home/background/zopetest/lib/python/Products/CMFCore/tests/base/testcase.py", line 23, in setUp
    TransactionalTest.setUp(self)
  File "/home/background/zopetest/lib/python/Products/CMFCore/tests/base/testcase.py", line 13, in setUp
    self.connection = Zope.DB.open()
AttributeError: 'Zope' module has no attribute 'DB'
======================================================================
ERROR: test_HtmlWithoutNewlines (test_Document.DocumentTests)
----------------------------------------------------------------------
Traceback (most recent call last):
  File "test_Document.py", line 18, in setUp
  File "/home/background/zopetest/lib/python/Products/CMFCore/tests/base/testcase.py", line 23, in setUp
    TransactionalTest.setUp(self)
  File "/home/background/zopetest/lib/python/Products/CMFCore/tests/base/testcase.py", line 13, in setUp
    self.connection = Zope.DB.open()
AttributeError: 'Zope' module has no attribute 'DB'
======================================================================
ERROR: test_Init (test_Document.DocumentTests)
----------------------------------------------------------------------
Traceback (most recent call last):
  File "test_Document.py", line 18, in setUp
  File "/home/background/zopetest/lib/python/Products/CMFCore/tests/base/testcase.py", line 23, in setUp
    TransactionalTest.setUp(self)
  File "/home/background/zopetest/lib/python/Products/CMFCore/tests/base/testcase.py", line 13, in setUp
    self.connection = Zope.DB.open()
AttributeError: 'Zope' module has no attribute 'DB'
======================================================================
ERROR: test_STX_Levels (test_Document.DocumentTests)
----------------------------------------------------------------------
Traceback (most recent call last):
  File "test_Document.py", line 18, in setUp
  File "/home/background/zopetest/lib/python/Products/CMFCore/tests/base/testcase.py", line 23, in setUp
    TransactionalTest.setUp(self)
  File "/home/background/zopetest/lib/python/Products/CMFCore/tests/base/testcase.py", line 13, in setUp
    self.connection = Zope.DB.open()
AttributeError: 'Zope' module has no attribute 'DB'
======================================================================
ERROR: test_STX_NoHeaders (test_Document.DocumentTests)
----------------------------------------------------------------------
Traceback (most recent call last):
  File "test_Document.py", line 18, in setUp
  File "/home/background/zopetest/lib/python/Products/CMFCore/tests/base/testcase.py", line 23, in setUp
    TransactionalTest.setUp(self)
  File "/home/background/zopetest/lib/python/Products/CMFCore/tests/base/testcase.py", line 13, in setUp
    self.connection = Zope.DB.open()
AttributeError: 'Zope' module has no attribute 'DB'
======================================================================
ERROR: test_STX_NoHeaders_but_colon (test_Document.DocumentTests)
----------------------------------------------------------------------
Traceback (most recent call last):
  File "test_Document.py", line 18, in setUp
  File "/home/background/zopetest/lib/python/Products/CMFCore/tests/base/testcase.py", line 23, in setUp
    TransactionalTest.setUp(self)
  File "/home/background/zopetest/lib/python/Products/CMFCore/tests/base/testcase.py", line 13, in setUp
    self.connection = Zope.DB.open()
AttributeError: 'Zope' module has no attribute 'DB'
======================================================================
ERROR: test_StructuredText (test_Document.DocumentTests)
----------------------------------------------------------------------
Traceback (most recent call last):
  File "test_Document.py", line 18, in setUp
  File "/home/background/zopetest/lib/python/Products/CMFCore/tests/base/testcase.py", line 23, in setUp
    TransactionalTest.setUp(self)
  File "/home/background/zopetest/lib/python/Products/CMFCore/tests/base/testcase.py", line 13, in setUp
    self.connection = Zope.DB.open()
AttributeError: 'Zope' module has no attribute 'DB'
======================================================================
ERROR: test_UpperedHtml (test_Document.DocumentTests)
----------------------------------------------------------------------
Traceback (most recent call last):
  File "test_Document.py", line 18, in setUp
  File "/home/background/zopetest/lib/python/Products/CMFCore/tests/base/testcase.py", line 23, in setUp
    TransactionalTest.setUp(self)
  File "/home/background/zopetest/lib/python/Products/CMFCore/tests/base/testcase.py", line 13, in setUp
    self.connection = Zope.DB.open()
AttributeError: 'Zope' module has no attribute 'DB'
======================================================================
ERROR: test_ZMI_edit (test_Document.DocumentTests)
----------------------------------------------------------------------
Traceback (most recent call last):
  File "test_Document.py", line 18, in setUp
  File "/home/background/zopetest/lib/python/Products/CMFCore/tests/base/testcase.py", line 23, in setUp
    TransactionalTest.setUp(self)
  File "/home/background/zopetest/lib/python/Products/CMFCore/tests/base/testcase.py", line 13, in setUp
    self.connection = Zope.DB.open()
AttributeError: 'Zope' module has no attribute 'DB'
======================================================================
ERROR: testHTML (test_Document.TestFTPGet)
----------------------------------------------------------------------
Traceback (most recent call last):
  File "/home/background/zopetest/lib/python/Products/CMFCore/tests/base/testcase.py", line 23, in setUp
    TransactionalTest.setUp(self)
  File "/home/background/zopetest/lib/python/Products/CMFCore/tests/base/testcase.py", line 13, in setUp
    self.connection = Zope.DB.open()
AttributeError: 'Zope' module has no attribute 'DB'
======================================================================
ERROR: testSTX (test_Document.TestFTPGet)
----------------------------------------------------------------------
Traceback (most recent call last):
  File "/home/background/zopetest/lib/python/Products/CMFCore/tests/base/testcase.py", line 23, in setUp
    TransactionalTest.setUp(self)
  File "/home/background/zopetest/lib/python/Products/CMFCore/tests/base/testcase.py", line 13, in setUp
    self.connection = Zope.DB.open()
AttributeError: 'Zope' module has no attribute 'DB'
======================================================================
ERROR: test_PutHtml (test_Document.TestDocumentPUT)
----------------------------------------------------------------------
Traceback (most recent call last):
  File "test_Document.py", line 316, in setUp
  File "/home/background/zopetest/lib/python/Products/CMFCore/tests/base/testcase.py", line 23, in setUp
    TransactionalTest.setUp(self)
  File "/home/background/zopetest/lib/python/Products/CMFCore/tests/base/testcase.py", line 13, in setUp
    self.connection = Zope.DB.open()
AttributeError: 'Zope' module has no attribute 'DB'
======================================================================
ERROR: test_PutHtmlWithDoctype (test_Document.TestDocumentPUT)
----------------------------------------------------------------------
Traceback (most recent call last):
  File "test_Document.py", line 316, in setUp
  File "/home/background/zopetest/lib/python/Products/CMFCore/tests/base/testcase.py", line 23, in setUp
    TransactionalTest.setUp(self)
  File "/home/background/zopetest/lib/python/Products/CMFCore/tests/base/testcase.py", line 13, in setUp
    self.connection = Zope.DB.open()
AttributeError: 'Zope' module has no attribute 'DB'
======================================================================
ERROR: test_PutStructuredText (test_Document.TestDocumentPUT)
----------------------------------------------------------------------
Traceback (most recent call last):
  File "test_Document.py", line 316, in setUp
  File "/home/background/zopetest/lib/python/Products/CMFCore/tests/base/testcase.py", line 23, in setUp
    TransactionalTest.setUp(self)
  File "/home/background/zopetest/lib/python/Products/CMFCore/tests/base/testcase.py", line 13, in setUp
    self.connection = Zope.DB.open()
AttributeError: 'Zope' module has no attribute 'DB'
======================================================================
ERROR: test_PutStructuredTextWithHTML (test_Document.TestDocumentPUT)
----------------------------------------------------------------------
Traceback (most recent call last):
  File "test_Document.py", line 316, in setUp
  File "/home/background/zopetest/lib/python/Products/CMFCore/tests/base/testcase.py", line 23, in setUp
    TransactionalTest.setUp(self)
  File "/home/background/zopetest/lib/python/Products/CMFCore/tests/base/testcase.py", line 13, in setUp
    self.connection = Zope.DB.open()
AttributeError: 'Zope' module has no attribute 'DB'
======================================================================
ERROR: test ISOSplitter
----------------------------------------------------------------------
Traceback (most recent call last):
  File "testSplitter.py", line 67, in testISOSplitter
  File "testSplitter.py", line 52, in _test
  File "/home/background/zopetest/lib/python/Products/PluginIndexes/TextIndex/Splitter/__init__.py", line 31, in getSplitter
    exec( "from %s import Splitter as %s" % (name,name))
  File "<string>", line 1, in ?
  File "/home/background/zopetest/lib/python/Products/PluginIndexes/TextIndex/Splitter/ISO_8859_1_Splitter/__init__.py", line 1, in ?
    from ISO_8859_1_Splitter import ISO_8859_1_Splitter
ImportError: No module named ISO_8859_1_Splitter
======================================================================
ERROR: test_AddingOtherTypeInfos (test_TypesTool.TypesToolTests)
----------------------------------------------------------------------
Traceback (most recent call last):
  File "test_TypesTool.py", line 30, in setUp
  File "/home/background/zopetest/lib/python/Products/CMFCore/tests/base/testcase.py", line 48, in setUp
    SecurityTest.setUp(self)
  File "/home/background/zopetest/lib/python/Products/CMFCore/tests/base/testcase.py", line 35, in setUp
    self.connection = Zope.DB.open()
AttributeError: 'Zope' module has no attribute 'DB'
======================================================================
ERROR: test_allMetaTypes (test_TypesTool.TypesToolTests)
----------------------------------------------------------------------
Traceback (most recent call last):
  File "test_TypesTool.py", line 30, in setUp
  File "/home/background/zopetest/lib/python/Products/CMFCore/tests/base/testcase.py", line 48, in setUp
    SecurityTest.setUp(self)
  File "/home/background/zopetest/lib/python/Products/CMFCore/tests/base/testcase.py", line 35, in setUp
    self.connection = Zope.DB.open()
AttributeError: 'Zope' module has no attribute 'DB'
======================================================================
ERROR: test_processActions (test_TypesTool.TypesToolTests)
----------------------------------------------------------------------
Traceback (most recent call last):
  File "test_TypesTool.py", line 30, in setUp
  File "/home/background/zopetest/lib/python/Products/CMFCore/tests/base/testcase.py", line 48, in setUp
    SecurityTest.setUp(self)
  File "/home/background/zopetest/lib/python/Products/CMFCore/tests/base/testcase.py", line 35, in setUp
    self.connection = Zope.DB.open()
AttributeError: 'Zope' module has no attribute 'DB'
======================================================================
ERROR: test_anonymous_ec (test_Expression.ExpressionTests)
----------------------------------------------------------------------
Traceback (most recent call last):
  File "test_Expression.py", line 17, in setUp
  File "/home/background/zopetest/lib/python/Products/CMFCore/tests/base/testcase.py", line 35, in setUp
    self.connection = Zope.DB.open()
AttributeError: 'Zope' module has no attribute 'DB'
======================================================================
ERROR: test_authenticatedUser_ec (test_Expression.ExpressionTests)
----------------------------------------------------------------------
Traceback (most recent call last):
  File "test_Expression.py", line 17, in setUp
  File "/home/background/zopetest/lib/python/Products/CMFCore/tests/base/testcase.py", line 35, in setUp
    self.connection = Zope.DB.open()
AttributeError: 'Zope' module has no attribute 'DB'
======================================================================
ERROR: test_ec_context (test_Expression.ExpressionTests)
----------------------------------------------------------------------
Traceback (most recent call last):
  File "test_Expression.py", line 17, in setUp
  File "/home/background/zopetest/lib/python/Products/CMFCore/tests/base/testcase.py", line 35, in setUp
    self.connection = Zope.DB.open()
AttributeError: 'Zope' module has no attribute 'DB'
======================================================================
ERROR: test_BadCall (test_FSPageTemplate.FSPageTemplateTests)
----------------------------------------------------------------------
Traceback (most recent call last):
  File "test_FSPageTemplate.py", line 24, in test_BadCall
AttributeError: 'Zope' module has no attribute 'app'
======================================================================
ERROR: test_Call (test_FSPageTemplate.FSPageTemplateTests)
----------------------------------------------------------------------
Traceback (most recent call last):
  File "test_FSPageTemplate.py", line 15, in test_Call
AttributeError: 'Zope' module has no attribute 'app'
======================================================================
ERROR: test_Condition (test_ActionInformation.ActionInformationTests)
----------------------------------------------------------------------
Traceback (most recent call last):
  File "test_ActionInformation.py", line 17, in setUp
  File "/home/background/zopetest/lib/python/Products/CMFCore/tests/base/testcase.py", line 13, in setUp
    self.connection = Zope.DB.open()
AttributeError: 'Zope' module has no attribute 'DB'
======================================================================
ERROR: test_basic_construction (test_ActionInformation.ActionInformationTests)
----------------------------------------------------------------------
Traceback (most recent call last):
  File "test_ActionInformation.py", line 17, in setUp
  File "/home/background/zopetest/lib/python/Products/CMFCore/tests/base/testcase.py", line 13, in setUp
    self.connection = Zope.DB.open()
AttributeError: 'Zope' module has no attribute 'DB'
======================================================================
ERROR: test_construction_with_Expressions (test_ActionInformation.ActionInformationTests)
----------------------------------------------------------------------
Traceback (most recent call last):
  File "test_ActionInformation.py", line 17, in setUp
  File "/home/background/zopetest/lib/python/Products/CMFCore/tests/base/testcase.py", line 13, in setUp
    self.connection = Zope.DB.open()
AttributeError: 'Zope' module has no attribute 'DB'
======================================================================
FAIL: test_isConstructionAllowed_wo_Security (test_TypesTool.FTIConstructionTests)
----------------------------------------------------------------------
Traceback (most recent call last):
  File "test_TypesTool.py", line 342, in test_isConstructionAllowed_wo_Security
  File "/usr/lib/python2.1/unittest.py", line 245, in failIf
    if expr: raise self.failureException, msg
AssertionError
======================================================================
FAIL: test_constructInstance_wo_Roles (test_TypesTool.FTIConstructionTests_w_Roles)
----------------------------------------------------------------------
Traceback (most recent call last):
  File "test_TypesTool.py", line 393, in test_constructInstance_wo_Roles
  File "/usr/lib/python2.1/unittest.py", line 266, in failUnlessRaises
    raise self.failureException, excName
AssertionError: Unauthorized
======================================================================
FAIL: test_isConstructionAllowed_wo_Role (test_TypesTool.FTIConstructionTests_w_Roles)
----------------------------------------------------------------------
Traceback (most recent call last):
  File "test_TypesTool.py", line 383, in test_isConstructionAllowed_wo_Role
  File "/usr/lib/python2.1/unittest.py", line 266, in failUnlessRaises
    raise self.failureException, excName
AssertionError: Unauthorized
----------------------------------------------------------------------
Ran 850 tests in 114.863s

FAILED (failures=3, errors=41)

======================================================================
OVERALL FAILED (total failures=3, total errors=41)

**********************************************************************
Zope CVS Head with Python 2.2 (plus distutils-config-branch)
**********************************************************************
Module testDemoStorage.py failed to load
exceptions.ImportError: No module named _OOBTree
  File "utilities/testrunner.py", line 60, in getSuiteFromFile
   File "testDemoStorage.py", line 1, in ?
    import ZODB.DemoStorage
   File "/home/background/zopetest/lib/python/ZODB/DemoStorage.py", line 88, in ?
    from BTrees import OOBTree
   File "../../BTrees/OOBTree.py", line 16, in ?
    from _OOBTree import *


Module testfsIndex.py failed to load
exceptions.ImportError: cannot import name fsIndex
  File "utilities/testrunner.py", line 60, in getSuiteFromFile
   File "testfsIndex.py", line 3, in ?
    from ZODB.fsIndex import fsIndex


Module testCopySupport.py failed to load
exceptions.ImportError: No module named _IIBTree
  File "utilities/testrunner.py", line 60, in getSuiteFromFile
   File "testCopySupport.py", line 5, in ?
    from OFS.Application import Application
   File "/home/background/zopetest/lib/python/OFS/Application.py", line 18, in ?
    import Globals,Folder,os,sys,App.Product, App.ProductRegistry, misc_
   File "/home/background/zopetest/lib/python/App/Product.py", line 46, in ?
    from HelpSys.HelpSys import ProductHelp
   File "/home/background/zopetest/lib/python/HelpSys/__init__.py", line 15, in ?
    import HelpSys
   File "/home/background/zopetest/lib/python/HelpSys/HelpSys.py", line 18, in ?
    from Products.ZCatalog.ZCatalog import ZCatalog
   File "/home/background/zopetest/lib/python/Products/ZCatalog/__init__.py", line 16, in ?
    import ZCatalog, Catalog, CatalogAwareness,  ZClasses
   File "/home/background/zopetest/lib/python/Products/ZCatalog/ZCatalog.py", line 27, in ?
    from Catalog import Catalog, CatalogError
   File "/home/background/zopetest/lib/python/Products/ZCatalog/Catalog.py", line 17, in ?
    from Products.PluginIndexes.TextIndex.Lexicon import Lexicon
   File "/home/background/zopetest/lib/python/Products/PluginIndexes/__init__.py", line 15, in ?
    import common.ResultList     as ResultList
   File "/home/background/zopetest/lib/python/Products/PluginIndexes/common/ResultList.py", line 14, in ?
    from BTrees.IIBTree import IIBucket
   File "../../BTrees/IIBTree.py", line 16, in ?
    from _IIBTree import *


Module testRanges.py failed to load
exceptions.ImportError: cannot import name Application
  File "utilities/testrunner.py", line 60, in getSuiteFromFile
   File "testRanges.py", line 17, in ?
    from OFS.Application import Application


Module testConflict.py failed to load
exceptions.ImportError: cannot import name OOBTree
  File "utilities/testrunner.py", line 60, in getSuiteFromFile
   File "testConflict.py", line 16, in ?
    from BTrees.OOBTree import OOBTree, OOBucket, OOSet, OOTreeSet


Module testBTrees.py failed to load
exceptions.ImportError: cannot import name OOBTree
  File "utilities/testrunner.py", line 60, in getSuiteFromFile
   File "testBTrees.py", line 17, in ?
    from BTrees.OOBTree import OOBTree, OOBucket, OOSet, OOTreeSet


Module testBTreesUnicode.py failed to load
exceptions.ImportError: cannot import name OOBTree
  File "utilities/testrunner.py", line 60, in getSuiteFromFile
   File "testBTreesUnicode.py", line 18, in ?
    from BTrees.OOBTree import OOBTree


/usr/local/lib/python2.2/FCNTL.py:7: DeprecationWarning: the FCNTL module is deprecated; please use fcntl
  DeprecationWarning)
Module test_all.py failed to load
exceptions.AttributeError: 'module' object has no attribute 'import_products'
  File "utilities/testrunner.py", line 60, in getSuiteFromFile
   File "test_all.py", line 2, in ?
    import Zope
   File "/home/background/zopetest/lib/python/Zope/__init__.py", line 29, in ?
    OFS.Application.import_products()


Module testTimeoutRelated.py failed to load
exceptions.ImportError: No module named Length
  File "utilities/testrunner.py", line 60, in getSuiteFromFile
   File "testTimeoutRelated.py", line 11, in ?
    from Products.Transience.Transience import TransientObjectContainer
   File "/home/background/zopetest/lib/python/Products/Transience/__init__.py", line 20, in ?
    import Transience
   File "/home/background/zopetest/lib/python/Products/Transience/Transience.py", line 32, in ?
    from BTrees.Length import Length


Module testTransientObject.py failed to load
exceptions.ImportError: cannot import name TransientObjectContainer
  File "utilities/testrunner.py", line 60, in getSuiteFromFile
   File "testTransientObject.py", line 19, in ?
    from Products.Transience.Transience import TransientObjectContainer


Module testTransientObjectContainer.py failed to load
exceptions.ImportError: cannot import name TransientObjectContainer
  File "utilities/testrunner.py", line 60, in getSuiteFromFile
   File "testTransientObjectContainer.py", line 19, in ?
    from Products.Transience.Transience import TransientObjectContainer,\


Module test_join.py failed to load
exceptions.ImportError: cannot import name ZCatalog
  File "utilities/testrunner.py", line 60, in getSuiteFromFile
   File "test_join.py", line 4, in ?
    from Products.CMFCore.tests.base.testcase import \
   File "/home/background/zopetest/lib/python/Products/CMFCore/__init__.py", line 17, in ?
    import MembershipTool, WorkflowTool, CatalogTool, DiscussionTool
   File "/home/background/zopetest/lib/python/Products/CMFCore/CatalogTool.py", line 23, in ?
    from Products.ZCatalog.ZCatalog import ZCatalog


Module test_Discussions.py failed to load
exceptions.ImportError: cannot import name CatalogTool
  File "utilities/testrunner.py", line 60, in getSuiteFromFile
   File "test_Discussions.py", line 13, in ?
    from Products.CMFCore.CatalogTool import CatalogTool


No test suite found in file:
/home/background/zopetest/lib/python/Products/CMFDefault/tests/test_all.py

Module testUnicodeSplitter.py failed to load
exceptions.ImportError: No module named UnicodeSplitter
  File "utilities/testrunner.py", line 60, in getSuiteFromFile
   File "testUnicodeSplitter.py", line 2, in ?
    from Products.PluginIndexes.TextIndex.Splitter.UnicodeSplitter.UnicodeSplitter import UnicodeSplitter
   File "/home/background/zopetest/lib/python/Products/PluginIndexes/TextIndex/Splitter/UnicodeSplitter/__init__.py", line 1, in ?
    from UnicodeSplitter import UnicodeSplitter as Splitter


Module testTextIndex.py failed to load
exceptions.ImportError: cannot import name ResultList
  File "utilities/testrunner.py", line 60, in getSuiteFromFile
   File "testTextIndex.py", line 24, in ?
    from Products.PluginIndexes.TextIndex import TextIndex
   File "/home/background/zopetest/lib/python/Products/PluginIndexes/TextIndex/TextIndex.py", line 27, in ?
    from Products.PluginIndexes.common.ResultList import ResultList


Module testKeywordIndex.py failed to load
exceptions.ImportError: cannot import name OOSet
  File "utilities/testrunner.py", line 60, in getSuiteFromFile
   File "testKeywordIndex.py", line 15, in ?
    from Products.PluginIndexes.KeywordIndex.KeywordIndex import KeywordIndex
   File "/home/background/zopetest/lib/python/Products/PluginIndexes/KeywordIndex/KeywordIndex.py", line 16, in ?
    from BTrees.OOBTree import OOSet, difference


Module testPathIndex.py failed to load
exceptions.ImportError: No module named IOBTree
  File "utilities/testrunner.py", line 60, in getSuiteFromFile
   File "testPathIndex.py", line 16, in ?
    from Products.PluginIndexes.PathIndex.PathIndex import PathIndex
   File "/home/background/zopetest/lib/python/Products/PluginIndexes/PathIndex/PathIndex.py", line 24, in ?
    from BTrees.IOBTree import IOBTree


Module testFieldIndex.py failed to load
exceptions.ImportError: cannot import name OOBTree
  File "utilities/testrunner.py", line 60, in getSuiteFromFile
   File "testFieldIndex.py", line 17, in ?
    from Products.PluginIndexes.FieldIndex.FieldIndex import FieldIndex
   File "/home/background/zopetest/lib/python/Products/PluginIndexes/FieldIndex/FieldIndex.py", line 25, in ?
    from BTrees.OOBTree import OOBTree, OOSet


Module test_IssueDescription.py failed to load
exceptions.ImportError: cannot import name CatalogTool
  File "utilities/testrunner.py", line 60, in getSuiteFromFile
   File "test_IssueDescription.py", line 2, in ?
    from Products.CMFTracker.tests.utils import *
   File "/home/background/zopetest/lib/python/Products/CMFTracker/tests/utils.py", line 5, in ?
    from Products.CMFCore.CatalogTool import CatalogTool


No test suite found in file:
/home/background/zopetest/lib/python/Products/CMFTracker/tests/test_all.py

Module test_CatalogTool.py failed to load
exceptions.ImportError: cannot import name CatalogTool
  File "utilities/testrunner.py", line 60, in getSuiteFromFile
   File "test_CatalogTool.py", line 7, in ?
    from Products.CMFCore.CatalogTool import CatalogTool


No test suite found in file:
/home/background/zopetest/lib/python/Products/CMFCore/tests/test_all.py

Module test_PortalFolder.py failed to load
exceptions.ImportError: cannot import name CatalogTool
  File "utilities/testrunner.py", line 60, in getSuiteFromFile
   File "/home/background/zopetest/lib/python/Products/CMFCore/tests/test_PortalFolder.py", line 16, in ?
    from Products.CMFCore.CatalogTool import CatalogTool


Module testCatalog.py failed to load
exceptions.ImportError: cannot import name DemoStorage
  File "utilities/testrunner.py", line 60, in getSuiteFromFile
   File "testCatalog.py", line 8, in ?
    from ZODB.DemoStorage import DemoStorage


Module testSessionDataManager.py failed to load
exceptions.ImportError: cannot import name TransientObjectContainer
  File "utilities/testrunner.py", line 60, in getSuiteFromFile
   File "testSessionDataManager.py", line 25, in ?
    from Products.Transience.Transience import \


FullTest.checkVersionIterator() temporarily disabled.
======================================================================
ERROR: test_BasicHtml (test_NewsItem.NewsItemTests)
----------------------------------------------------------------------
Traceback (most recent call last):
  File "test_NewsItem.py", line 14, in setUp
  File "/home/background/zopetest/lib/python/Products/CMFCore/tests/base/testcase.py", line 23, in setUp
    TransactionalTest.setUp(self)
  File "/home/background/zopetest/lib/python/Products/CMFCore/tests/base/testcase.py", line 13, in setUp
    self.connection = Zope.DB.open()
AttributeError: 'module' object has no attribute 'DB'

======================================================================
ERROR: test_Empty (test_NewsItem.NewsItemTests)
----------------------------------------------------------------------
Traceback (most recent call last):
  File "test_NewsItem.py", line 14, in setUp
  File "/home/background/zopetest/lib/python/Products/CMFCore/tests/base/testcase.py", line 23, in setUp
    TransactionalTest.setUp(self)
  File "/home/background/zopetest/lib/python/Products/CMFCore/tests/base/testcase.py", line 13, in setUp
    self.connection = Zope.DB.open()
AttributeError: 'module' object has no attribute 'DB'

======================================================================
ERROR: test_EntityInTitle (test_NewsItem.NewsItemTests)
----------------------------------------------------------------------
Traceback (most recent call last):
  File "test_NewsItem.py", line 14, in setUp
  File "/home/background/zopetest/lib/python/Products/CMFCore/tests/base/testcase.py", line 23, in setUp
    TransactionalTest.setUp(self)
  File "/home/background/zopetest/lib/python/Products/CMFCore/tests/base/testcase.py", line 13, in setUp
    self.connection = Zope.DB.open()
AttributeError: 'module' object has no attribute 'DB'

======================================================================
ERROR: test_HtmlWithDoctype (test_NewsItem.NewsItemTests)
----------------------------------------------------------------------
Traceback (most recent call last):
  File "test_NewsItem.py", line 14, in setUp
  File "/home/background/zopetest/lib/python/Products/CMFCore/tests/base/testcase.py", line 23, in setUp
    TransactionalTest.setUp(self)
  File "/home/background/zopetest/lib/python/Products/CMFCore/tests/base/testcase.py", line 13, in setUp
    self.connection = Zope.DB.open()
AttributeError: 'module' object has no attribute 'DB'

======================================================================
ERROR: test_HtmlWithoutNewlines (test_NewsItem.NewsItemTests)
----------------------------------------------------------------------
Traceback (most recent call last):
  File "test_NewsItem.py", line 14, in setUp
  File "/home/background/zopetest/lib/python/Products/CMFCore/tests/base/testcase.py", line 23, in setUp
    TransactionalTest.setUp(self)
  File "/home/background/zopetest/lib/python/Products/CMFCore/tests/base/testcase.py", line 13, in setUp
    self.connection = Zope.DB.open()
AttributeError: 'module' object has no attribute 'DB'

======================================================================
ERROR: test_Init (test_NewsItem.NewsItemTests)
----------------------------------------------------------------------
Traceback (most recent call last):
  File "test_NewsItem.py", line 14, in setUp
  File "/home/background/zopetest/lib/python/Products/CMFCore/tests/base/testcase.py", line 23, in setUp
    TransactionalTest.setUp(self)
  File "/home/background/zopetest/lib/python/Products/CMFCore/tests/base/testcase.py", line 13, in setUp
    self.connection = Zope.DB.open()
AttributeError: 'module' object has no attribute 'DB'

======================================================================
ERROR: test_StructuredText (test_NewsItem.NewsItemTests)
----------------------------------------------------------------------
Traceback (most recent call last):
  File "test_NewsItem.py", line 14, in setUp
  File "/home/background/zopetest/lib/python/Products/CMFCore/tests/base/testcase.py", line 23, in setUp
    TransactionalTest.setUp(self)
  File "/home/background/zopetest/lib/python/Products/CMFCore/tests/base/testcase.py", line 13, in setUp
    self.connection = Zope.DB.open()
AttributeError: 'module' object has no attribute 'DB'

======================================================================
ERROR: test_UpperedHtml (test_NewsItem.NewsItemTests)
----------------------------------------------------------------------
Traceback (most recent call last):
  File "test_NewsItem.py", line 14, in setUp
  File "/home/background/zopetest/lib/python/Products/CMFCore/tests/base/testcase.py", line 23, in setUp
    TransactionalTest.setUp(self)
  File "/home/background/zopetest/lib/python/Products/CMFCore/tests/base/testcase.py", line 13, in setUp
    self.connection = Zope.DB.open()
AttributeError: 'module' object has no attribute 'DB'

======================================================================
ERROR: test_BasicHtmlPUT (test_Document.DocumentTests)
----------------------------------------------------------------------
Traceback (most recent call last):
  File "test_Document.py", line 18, in setUp
  File "/home/background/zopetest/lib/python/Products/CMFCore/tests/base/testcase.py", line 23, in setUp
    TransactionalTest.setUp(self)
  File "/home/background/zopetest/lib/python/Products/CMFCore/tests/base/testcase.py", line 13, in setUp
    self.connection = Zope.DB.open()
AttributeError: 'module' object has no attribute 'DB'

======================================================================
ERROR: test_BigHtml (test_Document.DocumentTests)
----------------------------------------------------------------------
Traceback (most recent call last):
  File "test_Document.py", line 18, in setUp
  File "/home/background/zopetest/lib/python/Products/CMFCore/tests/base/testcase.py", line 23, in setUp
    TransactionalTest.setUp(self)
  File "/home/background/zopetest/lib/python/Products/CMFCore/tests/base/testcase.py", line 13, in setUp
    self.connection = Zope.DB.open()
AttributeError: 'module' object has no attribute 'DB'

======================================================================
ERROR: test_BigHtml_via_upload (test_Document.DocumentTests)
----------------------------------------------------------------------
Traceback (most recent call last):
  File "test_Document.py", line 18, in setUp
  File "/home/background/zopetest/lib/python/Products/CMFCore/tests/base/testcase.py", line 23, in setUp
    TransactionalTest.setUp(self)
  File "/home/background/zopetest/lib/python/Products/CMFCore/tests/base/testcase.py", line 13, in setUp
    self.connection = Zope.DB.open()
AttributeError: 'module' object has no attribute 'DB'

======================================================================
ERROR: test_EditStructuredTextWithHTML (test_Document.DocumentTests)
----------------------------------------------------------------------
Traceback (most recent call last):
  File "test_Document.py", line 18, in setUp
  File "/home/background/zopetest/lib/python/Products/CMFCore/tests/base/testcase.py", line 23, in setUp
    TransactionalTest.setUp(self)
  File "/home/background/zopetest/lib/python/Products/CMFCore/tests/base/testcase.py", line 13, in setUp
    self.connection = Zope.DB.open()
AttributeError: 'module' object has no attribute 'DB'

======================================================================
ERROR: test_Empty (test_Document.DocumentTests)
----------------------------------------------------------------------
Traceback (most recent call last):
  File "test_Document.py", line 18, in setUp
  File "/home/background/zopetest/lib/python/Products/CMFCore/tests/base/testcase.py", line 23, in setUp
    TransactionalTest.setUp(self)
  File "/home/background/zopetest/lib/python/Products/CMFCore/tests/base/testcase.py", line 13, in setUp
    self.connection = Zope.DB.open()
AttributeError: 'module' object has no attribute 'DB'

======================================================================
ERROR: test_EntityInTitle (test_Document.DocumentTests)
----------------------------------------------------------------------
Traceback (most recent call last):
  File "test_Document.py", line 18, in setUp
  File "/home/background/zopetest/lib/python/Products/CMFCore/tests/base/testcase.py", line 23, in setUp
    TransactionalTest.setUp(self)
  File "/home/background/zopetest/lib/python/Products/CMFCore/tests/base/testcase.py", line 13, in setUp
    self.connection = Zope.DB.open()
AttributeError: 'module' object has no attribute 'DB'

======================================================================
ERROR: test_HtmlWithDoctype (test_Document.DocumentTests)
----------------------------------------------------------------------
Traceback (most recent call last):
  File "test_Document.py", line 18, in setUp
  File "/home/background/zopetest/lib/python/Products/CMFCore/tests/base/testcase.py", line 23, in setUp
    TransactionalTest.setUp(self)
  File "/home/background/zopetest/lib/python/Products/CMFCore/tests/base/testcase.py", line 13, in setUp
    self.connection = Zope.DB.open()
AttributeError: 'module' object has no attribute 'DB'

======================================================================
ERROR: test_HtmlWithoutNewlines (test_Document.DocumentTests)
----------------------------------------------------------------------
Traceback (most recent call last):
  File "test_Document.py", line 18, in setUp
  File "/home/background/zopetest/lib/python/Products/CMFCore/tests/base/testcase.py", line 23, in setUp
    TransactionalTest.setUp(self)
  File "/home/background/zopetest/lib/python/Products/CMFCore/tests/base/testcase.py", line 13, in setUp
    self.connection = Zope.DB.open()
AttributeError: 'module' object has no attribute 'DB'

======================================================================
ERROR: test_Init (test_Document.DocumentTests)
----------------------------------------------------------------------
Traceback (most recent call last):
  File "test_Document.py", line 18, in setUp
  File "/home/background/zopetest/lib/python/Products/CMFCore/tests/base/testcase.py", line 23, in setUp
    TransactionalTest.setUp(self)
  File "/home/background/zopetest/lib/python/Products/CMFCore/tests/base/testcase.py", line 13, in setUp
    self.connection = Zope.DB.open()
AttributeError: 'module' object has no attribute 'DB'

======================================================================
ERROR: test_STX_Levels (test_Document.DocumentTests)
----------------------------------------------------------------------
Traceback (most recent call last):
  File "test_Document.py", line 18, in setUp
  File "/home/background/zopetest/lib/python/Products/CMFCore/tests/base/testcase.py", line 23, in setUp
    TransactionalTest.setUp(self)
  File "/home/background/zopetest/lib/python/Products/CMFCore/tests/base/testcase.py", line 13, in setUp
    self.connection = Zope.DB.open()
AttributeError: 'module' object has no attribute 'DB'

======================================================================
ERROR: test_STX_NoHeaders (test_Document.DocumentTests)
----------------------------------------------------------------------
Traceback (most recent call last):
  File "test_Document.py", line 18, in setUp
  File "/home/background/zopetest/lib/python/Products/CMFCore/tests/base/testcase.py", line 23, in setUp
    TransactionalTest.setUp(self)
  File "/home/background/zopetest/lib/python/Products/CMFCore/tests/base/testcase.py", line 13, in setUp
    self.connection = Zope.DB.open()
AttributeError: 'module' object has no attribute 'DB'

======================================================================
ERROR: test_STX_NoHeaders_but_colon (test_Document.DocumentTests)
----------------------------------------------------------------------
Traceback (most recent call last):
  File "test_Document.py", line 18, in setUp
  File "/home/background/zopetest/lib/python/Products/CMFCore/tests/base/testcase.py", line 23, in setUp
    TransactionalTest.setUp(self)
  File "/home/background/zopetest/lib/python/Products/CMFCore/tests/base/testcase.py", line 13, in setUp
    self.connection = Zope.DB.open()
AttributeError: 'module' object has no attribute 'DB'

======================================================================
ERROR: test_StructuredText (test_Document.DocumentTests)
----------------------------------------------------------------------
Traceback (most recent call last):
  File "test_Document.py", line 18, in setUp
  File "/home/background/zopetest/lib/python/Products/CMFCore/tests/base/testcase.py", line 23, in setUp
    TransactionalTest.setUp(self)
  File "/home/background/zopetest/lib/python/Products/CMFCore/tests/base/testcase.py", line 13, in setUp
    self.connection = Zope.DB.open()
AttributeError: 'module' object has no attribute 'DB'

======================================================================
ERROR: test_UpperedHtml (test_Document.DocumentTests)
----------------------------------------------------------------------
Traceback (most recent call last):
  File "test_Document.py", line 18, in setUp
  File "/home/background/zopetest/lib/python/Products/CMFCore/tests/base/testcase.py", line 23, in setUp
    TransactionalTest.setUp(self)
  File "/home/background/zopetest/lib/python/Products/CMFCore/tests/base/testcase.py", line 13, in setUp
    self.connection = Zope.DB.open()
AttributeError: 'module' object has no attribute 'DB'

======================================================================
ERROR: test_ZMI_edit (test_Document.DocumentTests)
----------------------------------------------------------------------
Traceback (most recent call last):
  File "test_Document.py", line 18, in setUp
  File "/home/background/zopetest/lib/python/Products/CMFCore/tests/base/testcase.py", line 23, in setUp
    TransactionalTest.setUp(self)
  File "/home/background/zopetest/lib/python/Products/CMFCore/tests/base/testcase.py", line 13, in setUp
    self.connection = Zope.DB.open()
AttributeError: 'module' object has no attribute 'DB'

======================================================================
ERROR: testHTML (test_Document.TestFTPGet)
----------------------------------------------------------------------
Traceback (most recent call last):
  File "/home/background/zopetest/lib/python/Products/CMFCore/tests/base/testcase.py", line 23, in setUp
    TransactionalTest.setUp(self)
  File "/home/background/zopetest/lib/python/Products/CMFCore/tests/base/testcase.py", line 13, in setUp
    self.connection = Zope.DB.open()
AttributeError: 'module' object has no attribute 'DB'

======================================================================
ERROR: testSTX (test_Document.TestFTPGet)
----------------------------------------------------------------------
Traceback (most recent call last):
  File "/home/background/zopetest/lib/python/Products/CMFCore/tests/base/testcase.py", line 23, in setUp
    TransactionalTest.setUp(self)
  File "/home/background/zopetest/lib/python/Products/CMFCore/tests/base/testcase.py", line 13, in setUp
    self.connection = Zope.DB.open()
AttributeError: 'module' object has no attribute 'DB'

======================================================================
ERROR: test_PutHtml (test_Document.TestDocumentPUT)
----------------------------------------------------------------------
Traceback (most recent call last):
  File "test_Document.py", line 316, in setUp
  File "/home/background/zopetest/lib/python/Products/CMFCore/tests/base/testcase.py", line 23, in setUp
    TransactionalTest.setUp(self)
  File "/home/background/zopetest/lib/python/Products/CMFCore/tests/base/testcase.py", line 13, in setUp
    self.connection = Zope.DB.open()
AttributeError: 'module' object has no attribute 'DB'

======================================================================
ERROR: test_PutHtmlWithDoctype (test_Document.TestDocumentPUT)
----------------------------------------------------------------------
Traceback (most recent call last):
  File "test_Document.py", line 316, in setUp
  File "/home/background/zopetest/lib/python/Products/CMFCore/tests/base/testcase.py", line 23, in setUp
    TransactionalTest.setUp(self)
  File "/home/background/zopetest/lib/python/Products/CMFCore/tests/base/testcase.py", line 13, in setUp
    self.connection = Zope.DB.open()
AttributeError: 'module' object has no attribute 'DB'

======================================================================
ERROR: test_PutStructuredText (test_Document.TestDocumentPUT)
----------------------------------------------------------------------
Traceback (most recent call last):
  File "test_Document.py", line 316, in setUp
  File "/home/background/zopetest/lib/python/Products/CMFCore/tests/base/testcase.py", line 23, in setUp
    TransactionalTest.setUp(self)
  File "/home/background/zopetest/lib/python/Products/CMFCore/tests/base/testcase.py", line 13, in setUp
    self.connection = Zope.DB.open()
AttributeError: 'module' object has no attribute 'DB'

======================================================================
ERROR: test_PutStructuredTextWithHTML (test_Document.TestDocumentPUT)
----------------------------------------------------------------------
Traceback (most recent call last):
  File "test_Document.py", line 316, in setUp
  File "/home/background/zopetest/lib/python/Products/CMFCore/tests/base/testcase.py", line 23, in setUp
    TransactionalTest.setUp(self)
  File "/home/background/zopetest/lib/python/Products/CMFCore/tests/base/testcase.py", line 13, in setUp
    self.connection = Zope.DB.open()
AttributeError: 'module' object has no attribute 'DB'

======================================================================
ERROR: test ISOSplitter
----------------------------------------------------------------------
Traceback (most recent call last):
  File "testSplitter.py", line 67, in testISOSplitter
  File "testSplitter.py", line 52, in _test
  File "/home/background/zopetest/lib/python/Products/PluginIndexes/TextIndex/Splitter/__init__.py", line 31, in getSplitter
    exec( "from %s import Splitter as %s" % (name,name))
  File "<string>", line 1, in ?
  File "/home/background/zopetest/lib/python/Products/PluginIndexes/TextIndex/Splitter/ISO_8859_1_Splitter/__init__.py", line 1, in ?
    from ISO_8859_1_Splitter import ISO_8859_1_Splitter
ImportError: No module named ISO_8859_1_Splitter

======================================================================
ERROR: test_AddingOtherTypeInfos (test_TypesTool.TypesToolTests)
----------------------------------------------------------------------
Traceback (most recent call last):
  File "test_TypesTool.py", line 30, in setUp
  File "/home/background/zopetest/lib/python/Products/CMFCore/tests/base/testcase.py", line 48, in setUp
    SecurityTest.setUp(self)
  File "/home/background/zopetest/lib/python/Products/CMFCore/tests/base/testcase.py", line 35, in setUp
    self.connection = Zope.DB.open()
AttributeError: 'module' object has no attribute 'DB'

======================================================================
ERROR: test_allMetaTypes (test_TypesTool.TypesToolTests)
----------------------------------------------------------------------
Traceback (most recent call last):
  File "test_TypesTool.py", line 30, in setUp
  File "/home/background/zopetest/lib/python/Products/CMFCore/tests/base/testcase.py", line 48, in setUp
    SecurityTest.setUp(self)
  File "/home/background/zopetest/lib/python/Products/CMFCore/tests/base/testcase.py", line 35, in setUp
    self.connection = Zope.DB.open()
AttributeError: 'module' object has no attribute 'DB'

======================================================================
ERROR: test_processActions (test_TypesTool.TypesToolTests)
----------------------------------------------------------------------
Traceback (most recent call last):
  File "test_TypesTool.py", line 30, in setUp
  File "/home/background/zopetest/lib/python/Products/CMFCore/tests/base/testcase.py", line 48, in setUp
    SecurityTest.setUp(self)
  File "/home/background/zopetest/lib/python/Products/CMFCore/tests/base/testcase.py", line 35, in setUp
    self.connection = Zope.DB.open()
AttributeError: 'module' object has no attribute 'DB'

======================================================================
ERROR: test_anonymous_ec (test_Expression.ExpressionTests)
----------------------------------------------------------------------
Traceback (most recent call last):
  File "test_Expression.py", line 17, in setUp
  File "/home/background/zopetest/lib/python/Products/CMFCore/tests/base/testcase.py", line 35, in setUp
    self.connection = Zope.DB.open()
AttributeError: 'module' object has no attribute 'DB'

======================================================================
ERROR: test_authenticatedUser_ec (test_Expression.ExpressionTests)
----------------------------------------------------------------------
Traceback (most recent call last):
  File "test_Expression.py", line 17, in setUp
  File "/home/background/zopetest/lib/python/Products/CMFCore/tests/base/testcase.py", line 35, in setUp
    self.connection = Zope.DB.open()
AttributeError: 'module' object has no attribute 'DB'

======================================================================
ERROR: test_ec_context (test_Expression.ExpressionTests)
----------------------------------------------------------------------
Traceback (most recent call last):
  File "test_Expression.py", line 17, in setUp
  File "/home/background/zopetest/lib/python/Products/CMFCore/tests/base/testcase.py", line 35, in setUp
    self.connection = Zope.DB.open()
AttributeError: 'module' object has no attribute 'DB'

======================================================================
ERROR: test_BadCall (test_FSPageTemplate.FSPageTemplateTests)
----------------------------------------------------------------------
Traceback (most recent call last):
  File "test_FSPageTemplate.py", line 24, in test_BadCall
AttributeError: 'module' object has no attribute 'app'

======================================================================
ERROR: test_Call (test_FSPageTemplate.FSPageTemplateTests)
----------------------------------------------------------------------
Traceback (most recent call last):
  File "test_FSPageTemplate.py", line 15, in test_Call
AttributeError: 'module' object has no attribute 'app'

======================================================================
ERROR: test_actionProviders (test_ActionsTool.ActionsToolTests)
----------------------------------------------------------------------
Traceback (most recent call last):
  File "test_ActionsTool.py", line 18, in setUp
  File "/home/background/zopetest/lib/python/Products/CMFCore/tests/base/testcase.py", line 48, in setUp
    SecurityTest.setUp(self)
  File "/home/background/zopetest/lib/python/Products/CMFCore/tests/base/testcase.py", line 35, in setUp
    self.connection = Zope.DB.open()
AttributeError: 'module' object has no attribute 'DB'

======================================================================
ERROR: test_addActionProvider (test_ActionsTool.ActionsToolTests)
----------------------------------------------------------------------
Traceback (most recent call last):
  File "test_ActionsTool.py", line 18, in setUp
  File "/home/background/zopetest/lib/python/Products/CMFCore/tests/base/testcase.py", line 48, in setUp
    SecurityTest.setUp(self)
  File "/home/background/zopetest/lib/python/Products/CMFCore/tests/base/testcase.py", line 35, in setUp
    self.connection = Zope.DB.open()
AttributeError: 'module' object has no attribute 'DB'

======================================================================
ERROR: test_delActionProvider (test_ActionsTool.ActionsToolTests)
----------------------------------------------------------------------
Traceback (most recent call last):
  File "test_ActionsTool.py", line 18, in setUp
  File "/home/background/zopetest/lib/python/Products/CMFCore/tests/base/testcase.py", line 48, in setUp
    SecurityTest.setUp(self)
  File "/home/background/zopetest/lib/python/Products/CMFCore/tests/base/testcase.py", line 35, in setUp
    self.connection = Zope.DB.open()
AttributeError: 'module' object has no attribute 'DB'

======================================================================
ERROR: test_listActionInformationActions (test_ActionsTool.ActionsToolTests)
----------------------------------------------------------------------
Traceback (most recent call last):
  File "test_ActionsTool.py", line 18, in setUp
  File "/home/background/zopetest/lib/python/Products/CMFCore/tests/base/testcase.py", line 48, in setUp
    SecurityTest.setUp(self)
  File "/home/background/zopetest/lib/python/Products/CMFCore/tests/base/testcase.py", line 35, in setUp
    self.connection = Zope.DB.open()
AttributeError: 'module' object has no attribute 'DB'

======================================================================
ERROR: test_listDictionaryActions (test_ActionsTool.ActionsToolTests)
----------------------------------------------------------------------
Traceback (most recent call last):
  File "test_ActionsTool.py", line 18, in setUp
  File "/home/background/zopetest/lib/python/Products/CMFCore/tests/base/testcase.py", line 48, in setUp
    SecurityTest.setUp(self)
  File "/home/background/zopetest/lib/python/Products/CMFCore/tests/base/testcase.py", line 35, in setUp
    self.connection = Zope.DB.open()
AttributeError: 'module' object has no attribute 'DB'

======================================================================
ERROR: test_Condition (test_ActionInformation.ActionInformationTests)
----------------------------------------------------------------------
Traceback (most recent call last):
  File "test_ActionInformation.py", line 17, in setUp
  File "/home/background/zopetest/lib/python/Products/CMFCore/tests/base/testcase.py", line 13, in setUp
    self.connection = Zope.DB.open()
AttributeError: 'module' object has no attribute 'DB'

======================================================================
ERROR: test_basic_construction (test_ActionInformation.ActionInformationTests)
----------------------------------------------------------------------
Traceback (most recent call last):
  File "test_ActionInformation.py", line 17, in setUp
  File "/home/background/zopetest/lib/python/Products/CMFCore/tests/base/testcase.py", line 13, in setUp
    self.connection = Zope.DB.open()
AttributeError: 'module' object has no attribute 'DB'

======================================================================
ERROR: test_construction_with_Expressions (test_ActionInformation.ActionInformationTests)
----------------------------------------------------------------------
Traceback (most recent call last):
  File "test_ActionInformation.py", line 17, in setUp
  File "/home/background/zopetest/lib/python/Products/CMFCore/tests/base/testcase.py", line 13, in setUp
    self.connection = Zope.DB.open()
AttributeError: 'module' object has no attribute 'DB'

======================================================================
FAIL: testBasicHTMLIn (testUserFolder.SecurityTests)
----------------------------------------------------------------------
Traceback (most recent call last):
  File "/home/background/zopetest/lib/python/DocumentTemplate/tests/testDTML.py", line 407, in testBasicHTMLIn
    assert result == expected, result
AssertionError: 
   , 
   , 
   , 
   , 
   , 


======================================================================
FAIL: testBasicHTMLIn2 (testUserFolder.SecurityTests)
----------------------------------------------------------------------
Traceback (most recent call last):
  File "/home/background/zopetest/lib/python/DocumentTemplate/tests/testDTML.py", line 422, in testBasicHTMLIn2
    assert result == expected, result
AssertionError: 
   
   
   


======================================================================
FAIL: testBasicHTMLIn3 (testUserFolder.SecurityTests)
----------------------------------------------------------------------
Traceback (most recent call last):
  File "/home/background/zopetest/lib/python/DocumentTemplate/tests/testDTML.py", line 431, in testBasicHTMLIn3
    assert result == expected, result
AssertionError: :=:=:

======================================================================
FAIL: testBasicStringIn (testUserFolder.SecurityTests)
----------------------------------------------------------------------
Traceback (most recent call last):
  File "/home/background/zopetest/lib/python/DocumentTemplate/tests/testDTML.py", line 473, in testBasicStringIn
    assert expected == result, result
AssertionError: 
   , 
   , 
   , 
   , 
   , 


======================================================================
FAIL: testBatchingEtc (testUserFolder.SecurityTests)
----------------------------------------------------------------------
Traceback (most recent call last):
  File "/home/background/zopetest/lib/python/DocumentTemplate/tests/testDTML.py", line 165, in testBatchingEtc
    self.assertEqual(res,expected)
  File "/usr/local/lib/python2.2/unittest.py", line 286, in failUnlessEqual
    raise self.failureException, \
AssertionError: '<html><head><title>Inventory by Dealer</title></head><body>\n<dl>\n(    -    )\n(    -    )\n(    -    )\n<dt></dt><dd>\n   <p>\n</dd>\n(    -    )\n(    -    )\n(    -    )\n<dt></dt><dd>\n   <p>\n</dd>\n(    -    )\n(    -    )\n(    -    )\n<dt></dt><dd>\n   <p>\n</dd>\n(    -    )\n(    -    )\n(    -    )\n<dt></dt><dd>\n   <p>\n</dd>\n(    -    )\n(    -    )\n(    -    )\n<dt></dt><dd>\n   <p>\n</dd>\n(    -    )\n(    -    )\n(    -    )\n(    -    )\n(    -    )\n(    -    )\n</dl>\n</body></html>\n' != '<html><head><title>Inventory by Dealer</title></head><body>\n<dl>\n(Bay Chevy 96 Chevrolet Caprice - Bay Chevy 96 Chevrolet Nova)\n(Bay Chevy 96 Chevrolet Corvett - Bay Chevy 96 Chevrolet Corsica)\n(Bay Chevy 96 Chevrolet Corsica - Colman Olds 96 Olds Ciera)\n<dt>Colman Olds</dt><dd>\n96 Olds Cutlass <p>\n95 Olds Cutlas <p>\n93 Dodge Shadow <p>\n94 Jeep Cheroke <p>\n92 Toyota Previa <p>\n</dd>\n(Colman Olds 93 Toyota Celica - Colman Olds 94 Honda Civic)\n(Colman Olds 93 Honda Civix - Spam Chev 96 Chevrolet Nova)\n(Spam Chev 96 Chevrolet Corvett - Spam Chev 96 Chevrolet Corsica)\n(Spam Chev 96 Chevrolet Corsica - Spam Olds 96 Olds Ciera)\n(Spam Olds 96 Olds Cutlass - Spam Olds 92 Toyota Previa)\n(Spam Olds 93 Toyota Celica - Spam Olds 93 Honda Civix)\n</dl>\n</body></html>\n'

======================================================================
FAIL: testHTMLInElse (testUserFolder.SecurityTests)
----------------------------------------------------------------------
Traceback (most recent call last):
  File "/home/background/zopetest/lib/python/DocumentTemplate/tests/testDTML.py", line 450, in testHTMLInElse
    assert result == expected, result
AssertionError: 





======================================================================
FAIL: testPropogatedError (testUserFolder.SecurityTests)
----------------------------------------------------------------------
Traceback (most recent call last):
  File "/home/background/zopetest/lib/python/DocumentTemplate/tests/testDTML.py", line 334, in testPropogatedError
    assert 0, 'Puke error not propogated'
AssertionError: Puke error not propogated

======================================================================
FAIL: Test automatic rendering of callable objects
----------------------------------------------------------------------
Traceback (most recent call last):
  File "/home/background/zopetest/lib/python/DocumentTemplate/tests/testDTML.py", line 347, in testRenderCallable
    assert res == expected, res
AssertionError: , , 

======================================================================
FAIL: testSequence1 (testUserFolder.SecurityTests)
----------------------------------------------------------------------
Traceback (most recent call last):
  File "/home/background/zopetest/lib/python/DocumentTemplate/tests/testDTML.py", line 234, in testSequence1
    assert res == expected, res
AssertionError:       

======================================================================
FAIL: testSequence2 (testUserFolder.SecurityTests)
----------------------------------------------------------------------
Traceback (most recent call last):
  File "/home/background/zopetest/lib/python/DocumentTemplate/tests/testDTML.py", line 242, in testSequence2
    assert res == expected, res
AssertionError: ------

======================================================================
FAIL: testSequenceSummaries (testUserFolder.SecurityTests)
----------------------------------------------------------------------
Traceback (most recent call last):
  File "/home/background/zopetest/lib/python/DocumentTemplate/tests/testDTML.py", line 200, in testSequenceSummaries
    assert res == expected, res
AssertionError: Variable "name": min= max= count= total= median= Variable "age": min= max= count= total= median= mean= s.d.=Variable "name": min= max= count= total= median= Variable "age": min= max= count= total= median= mean= s.d.=Variable "name": min= max= count= total= median= Variable "age": min= max= count= total= median= mean= s.d.=Variable "name": min= max= count= total= median= Variable "age": min= max= count= total= median= mean= s.d.=

======================================================================
FAIL: testSimpleString (testUserFolder.SecurityTests)
----------------------------------------------------------------------
Traceback (most recent call last):
  File "/home/background/zopetest/lib/python/DocumentTemplate/tests/testDTML.py", line 217, in testSimpleString
    assert res == expected, res
AssertionError

======================================================================
FAIL: testWith (testUserFolder.SecurityTests)
----------------------------------------------------------------------
Traceback (most recent call last):
  File "/home/background/zopetest/lib/python/DocumentTemplate/tests/testDTML.py", line 374, in testWith
    assert res == expected, res
AssertionError: Hi, my name is  and my height is  cm.

======================================================================
FAIL: test_fmt (testUserFolder.SecurityTests)
----------------------------------------------------------------------
Traceback (most recent call last):
  File "/home/background/zopetest/lib/python/DocumentTemplate/tests/testDTML.py", line 295, in test_fmt
    assert res == expected, res
AssertionError: 
            
            html=4200000
            url=4200000
            multi=4200000
            dollars=$4200000
            cents=$4200000.00
            dollars,=$4,200,000
            cents,=$4,200,000.00
            
            html=None
            url=None
            multi=None
            dollars=
            cents=
            dollars,=
            cents,=
            
            html=&lt;a href=&quot;spam&quot;&gt;
foo bar
            url=%3Ca%20href%3D%22spam%22%3E%0Afoo%20bar
            multi=<a href="spam"><br>
foo bar
            dollars=
            cents=
            dollars,=
            cents,=

======================================================================
FAIL: testBasicHTMLIn (testSecurity.SecurityTests)
----------------------------------------------------------------------
Traceback (most recent call last):
  File "/home/background/zopetest/lib/python/DocumentTemplate/tests/testDTML.py", line 407, in testBasicHTMLIn
    assert result == expected, result
AssertionError: 
   , 
   , 
   , 
   , 
   , 


======================================================================
FAIL: testBasicHTMLIn2 (testSecurity.SecurityTests)
----------------------------------------------------------------------
Traceback (most recent call last):
  File "/home/background/zopetest/lib/python/DocumentTemplate/tests/testDTML.py", line 422, in testBasicHTMLIn2
    assert result == expected, result
AssertionError: 
   
   
   


======================================================================
FAIL: testBasicHTMLIn3 (testSecurity.SecurityTests)
----------------------------------------------------------------------
Traceback (most recent call last):
  File "/home/background/zopetest/lib/python/DocumentTemplate/tests/testDTML.py", line 431, in testBasicHTMLIn3
    assert result == expected, result
AssertionError: :=:=:

======================================================================
FAIL: testBasicStringIn (testSecurity.SecurityTests)
----------------------------------------------------------------------
Traceback (most recent call last):
  File "/home/background/zopetest/lib/python/DocumentTemplate/tests/testDTML.py", line 473, in testBasicStringIn
    assert expected == result, result
AssertionError: 
   , 
   , 
   , 
   , 
   , 


======================================================================
FAIL: testBatchingEtc (testSecurity.SecurityTests)
----------------------------------------------------------------------
Traceback (most recent call last):
  File "/home/background/zopetest/lib/python/DocumentTemplate/tests/testDTML.py", line 165, in testBatchingEtc
    self.assertEqual(res,expected)
  File "/usr/local/lib/python2.2/unittest.py", line 286, in failUnlessEqual
    raise self.failureException, \
AssertionError: '<html><head><title>Inventory by Dealer</title></head><body>\n<dl>\n(    -    )\n(    -    )\n(    -    )\n<dt></dt><dd>\n   <p>\n</dd>\n(    -    )\n(    -    )\n(    -    )\n<dt></dt><dd>\n   <p>\n</dd>\n(    -    )\n(    -    )\n(    -    )\n<dt></dt><dd>\n   <p>\n</dd>\n(    -    )\n(    -    )\n(    -    )\n<dt></dt><dd>\n   <p>\n</dd>\n(    -    )\n(    -    )\n(    -    )\n<dt></dt><dd>\n   <p>\n</dd>\n(    -    )\n(    -    )\n(    -    )\n(    -    )\n(    -    )\n(    -    )\n</dl>\n</body></html>\n' != '<html><head><title>Inventory by Dealer</title></head><body>\n<dl>\n(Bay Chevy 96 Chevrolet Caprice - Bay Chevy 96 Chevrolet Nova)\n(Bay Chevy 96 Chevrolet Corvett - Bay Chevy 96 Chevrolet Corsica)\n(Bay Chevy 96 Chevrolet Corsica - Colman Olds 96 Olds Ciera)\n<dt>Colman Olds</dt><dd>\n96 Olds Cutlass <p>\n95 Olds Cutlas <p>\n93 Dodge Shadow <p>\n94 Jeep Cheroke <p>\n92 Toyota Previa <p>\n</dd>\n(Colman Olds 93 Toyota Celica - Colman Olds 94 Honda Civic)\n(Colman Olds 93 Honda Civix - Spam Chev 96 Chevrolet Nova)\n(Spam Chev 96 Chevrolet Corvett - Spam Chev 96 Chevrolet Corsica)\n(Spam Chev 96 Chevrolet Corsica - Spam Olds 96 Olds Ciera)\n(Spam Olds 96 Olds Cutlass - Spam Olds 92 Toyota Previa)\n(Spam Olds 93 Toyota Celica - Spam Olds 93 Honda Civix)\n</dl>\n</body></html>\n'

======================================================================
FAIL: testExprExplicitDeny (testSecurity.SecurityTests)
----------------------------------------------------------------------
Traceback (most recent call last):
  File "testSecurity.py", line 65, in testExprExplicitDeny
AssertionError: Did not deny attribute access

======================================================================
FAIL: testHTMLInElse (testSecurity.SecurityTests)
----------------------------------------------------------------------
Traceback (most recent call last):
  File "/home/background/zopetest/lib/python/DocumentTemplate/tests/testDTML.py", line 450, in testHTMLInElse
    assert result == expected, result
AssertionError: 





======================================================================
FAIL: testNoImplicitAccess (testSecurity.SecurityTests)
----------------------------------------------------------------------
Traceback (most recent call last):
  File "testSecurity.py", line 49, in testNoImplicitAccess
AssertionError: Did not protect class instance

======================================================================
FAIL: testPropogatedError (testSecurity.SecurityTests)
----------------------------------------------------------------------
Traceback (most recent call last):
  File "/home/background/zopetest/lib/python/DocumentTemplate/tests/testDTML.py", line 334, in testPropogatedError
    assert 0, 'Puke error not propogated'
AssertionError: Puke error not propogated

======================================================================
FAIL: Test automatic rendering of callable objects
----------------------------------------------------------------------
Traceback (most recent call last):
  File "/home/background/zopetest/lib/python/DocumentTemplate/tests/testDTML.py", line 347, in testRenderCallable
    assert res == expected, res
AssertionError: , , 

======================================================================
FAIL: testSecurityInSyntax (testSecurity.SecurityTests)
----------------------------------------------------------------------
Traceback (most recent call last):
  File "testSecurity.py", line 81, in testSecurityInSyntax
AssertionError: Did not catch bad expr

======================================================================
FAIL: testSequence1 (testSecurity.SecurityTests)
----------------------------------------------------------------------
Traceback (most recent call last):
  File "/home/background/zopetest/lib/python/DocumentTemplate/tests/testDTML.py", line 234, in testSequence1
    assert res == expected, res
AssertionError:       

======================================================================
FAIL: testSequence2 (testSecurity.SecurityTests)
----------------------------------------------------------------------
Traceback (most recent call last):
  File "/home/background/zopetest/lib/python/DocumentTemplate/tests/testDTML.py", line 242, in testSequence2
    assert res == expected, res
AssertionError: ------

======================================================================
FAIL: testSequenceSummaries (testSecurity.SecurityTests)
----------------------------------------------------------------------
Traceback (most recent call last):
  File "/home/background/zopetest/lib/python/DocumentTemplate/tests/testDTML.py", line 200, in testSequenceSummaries
    assert res == expected, res
AssertionError: Variable "name": min= max= count= total= median= Variable "age": min= max= count= total= median= mean= s.d.=Variable "name": min= max= count= total= median= Variable "age": min= max= count= total= median= mean= s.d.=Variable "name": min= max= count= total= median= Variable "age": min= max= count= total= median= mean= s.d.=Variable "name": min= max= count= total= median= Variable "age": min= max= count= total= median= mean= s.d.=

======================================================================
FAIL: testSimpleString (testSecurity.SecurityTests)
----------------------------------------------------------------------
Traceback (most recent call last):
  File "/home/background/zopetest/lib/python/DocumentTemplate/tests/testDTML.py", line 217, in testSimpleString
    assert res == expected, res
AssertionError

======================================================================
FAIL: testWith (testSecurity.SecurityTests)
----------------------------------------------------------------------
Traceback (most recent call last):
  File "/home/background/zopetest/lib/python/DocumentTemplate/tests/testDTML.py", line 374, in testWith
    assert res == expected, res
AssertionError: Hi, my name is  and my height is  cm.

======================================================================
FAIL: test_fmt (testSecurity.SecurityTests)
----------------------------------------------------------------------
Traceback (most recent call last):
  File "/home/background/zopetest/lib/python/DocumentTemplate/tests/testDTML.py", line 295, in test_fmt
    assert res == expected, res
AssertionError: 
            
            html=4200000
            url=4200000
            multi=4200000
            dollars=$4200000
            cents=$4200000.00
            dollars,=$4,200,000
            cents,=$4,200,000.00
            
            html=None
            url=None
            multi=None
            dollars=
            cents=
            dollars,=
            cents,=
            
            html=&lt;a href=&quot;spam&quot;&gt;
foo bar
            url=%3Ca%20href%3D%22spam%22%3E%0Afoo%20bar
            multi=<a href="spam"><br>
foo bar
            dollars=
            cents=
            dollars,=
            cents,=

======================================================================
FAIL: testBasicHTMLIn (testDTML.DTMLTests)
----------------------------------------------------------------------
Traceback (most recent call last):
  File "/home/background/zopetest/lib/python/DocumentTemplate/tests/testDTML.py", line 407, in testBasicHTMLIn
    assert result == expected, result
AssertionError: 
   , 
   , 
   , 
   , 
   , 


======================================================================
FAIL: testBasicHTMLIn2 (testDTML.DTMLTests)
----------------------------------------------------------------------
Traceback (most recent call last):
  File "/home/background/zopetest/lib/python/DocumentTemplate/tests/testDTML.py", line 422, in testBasicHTMLIn2
    assert result == expected, result
AssertionError: 
   
   
   


======================================================================
FAIL: testBasicHTMLIn3 (testDTML.DTMLTests)
----------------------------------------------------------------------
Traceback (most recent call last):
  File "/home/background/zopetest/lib/python/DocumentTemplate/tests/testDTML.py", line 431, in testBasicHTMLIn3
    assert result == expected, result
AssertionError: :=:=:

======================================================================
FAIL: testBasicStringIn (testDTML.DTMLTests)
----------------------------------------------------------------------
Traceback (most recent call last):
  File "/home/background/zopetest/lib/python/DocumentTemplate/tests/testDTML.py", line 473, in testBasicStringIn
    assert expected == result, result
AssertionError: 
   , 
   , 
   , 
   , 
   , 


======================================================================
FAIL: testBatchingEtc (testDTML.DTMLTests)
----------------------------------------------------------------------
Traceback (most recent call last):
  File "/home/background/zopetest/lib/python/DocumentTemplate/tests/testDTML.py", line 165, in testBatchingEtc
    self.assertEqual(res,expected)
  File "/usr/local/lib/python2.2/unittest.py", line 286, in failUnlessEqual
    raise self.failureException, \
AssertionError: '<html><head><title>Inventory by Dealer</title></head><body>\n<dl>\n(    -    )\n(    -    )\n(    -    )\n<dt></dt><dd>\n   <p>\n</dd>\n(    -    )\n(    -    )\n(    -    )\n<dt></dt><dd>\n   <p>\n</dd>\n(    -    )\n(    -    )\n(    -    )\n<dt></dt><dd>\n   <p>\n</dd>\n(    -    )\n(    -    )\n(    -    )\n<dt></dt><dd>\n   <p>\n</dd>\n(    -    )\n(    -    )\n(    -    )\n<dt></dt><dd>\n   <p>\n</dd>\n(    -    )\n(    -    )\n(    -    )\n(    -    )\n(    -    )\n(    -    )\n</dl>\n</body></html>\n' != '<html><head><title>Inventory by Dealer</title></head><body>\n<dl>\n(Bay Chevy 96 Chevrolet Caprice - Bay Chevy 96 Chevrolet Nova)\n(Bay Chevy 96 Chevrolet Corvett - Bay Chevy 96 Chevrolet Corsica)\n(Bay Chevy 96 Chevrolet Corsica - Colman Olds 96 Olds Ciera)\n<dt>Colman Olds</dt><dd>\n96 Olds Cutlass <p>\n95 Olds Cutlas <p>\n93 Dodge Shadow <p>\n94 Jeep Cheroke <p>\n92 Toyota Previa <p>\n</dd>\n(Colman Olds 93 Toyota Celica - Colman Olds 94 Honda Civic)\n(Colman Olds 93 Honda Civix - Spam Chev 96 Chevrolet Nova)\n(Spam Chev 96 Chevrolet Corvett - Spam Chev 96 Chevrolet Corsica)\n(Spam Chev 96 Chevrolet Corsica - Spam Olds 96 Olds Ciera)\n(Spam Olds 96 Olds Cutlass - Spam Olds 92 Toyota Previa)\n(Spam Olds 93 Toyota Celica - Spam Olds 93 Honda Civix)\n</dl>\n</body></html>\n'

======================================================================
FAIL: testHTMLInElse (testDTML.DTMLTests)
----------------------------------------------------------------------
Traceback (most recent call last):
  File "/home/background/zopetest/lib/python/DocumentTemplate/tests/testDTML.py", line 450, in testHTMLInElse
    assert result == expected, result
AssertionError: 





======================================================================
FAIL: testPropogatedError (testDTML.DTMLTests)
----------------------------------------------------------------------
Traceback (most recent call last):
  File "/home/background/zopetest/lib/python/DocumentTemplate/tests/testDTML.py", line 334, in testPropogatedError
    assert 0, 'Puke error not propogated'
AssertionError: Puke error not propogated

======================================================================
FAIL: Test automatic rendering of callable objects
----------------------------------------------------------------------
Traceback (most recent call last):
  File "/home/background/zopetest/lib/python/DocumentTemplate/tests/testDTML.py", line 347, in testRenderCallable
    assert res == expected, res
AssertionError: , , 

======================================================================
FAIL: testSequence1 (testDTML.DTMLTests)
----------------------------------------------------------------------
Traceback (most recent call last):
  File "/home/background/zopetest/lib/python/DocumentTemplate/tests/testDTML.py", line 234, in testSequence1
    assert res == expected, res
AssertionError:       

======================================================================
FAIL: testSequence2 (testDTML.DTMLTests)
----------------------------------------------------------------------
Traceback (most recent call last):
  File "/home/background/zopetest/lib/python/DocumentTemplate/tests/testDTML.py", line 242, in testSequence2
    assert res == expected, res
AssertionError: ------

======================================================================
FAIL: testSequenceSummaries (testDTML.DTMLTests)
----------------------------------------------------------------------
Traceback (most recent call last):
  File "/home/background/zopetest/lib/python/DocumentTemplate/tests/testDTML.py", line 200, in testSequenceSummaries
    assert res == expected, res
AssertionError: Variable "name": min= max= count= total= median= Variable "age": min= max= count= total= median= mean= s.d.=Variable "name": min= max= count= total= median= Variable "age": min= max= count= total= median= mean= s.d.=Variable "name": min= max= count= total= median= Variable "age": min= max= count= total= median= mean= s.d.=Variable "name": min= max= count= total= median= Variable "age": min= max= count= total= median= mean= s.d.=

======================================================================
FAIL: testSimpleString (testDTML.DTMLTests)
----------------------------------------------------------------------
Traceback (most recent call last):
  File "/home/background/zopetest/lib/python/DocumentTemplate/tests/testDTML.py", line 217, in testSimpleString
    assert res == expected, res
AssertionError

======================================================================
FAIL: testWith (testDTML.DTMLTests)
----------------------------------------------------------------------
Traceback (most recent call last):
  File "/home/background/zopetest/lib/python/DocumentTemplate/tests/testDTML.py", line 374, in testWith
    assert res == expected, res
AssertionError: Hi, my name is  and my height is  cm.

======================================================================
FAIL: test_fmt (testDTML.DTMLTests)
----------------------------------------------------------------------
Traceback (most recent call last):
  File "/home/background/zopetest/lib/python/DocumentTemplate/tests/testDTML.py", line 295, in test_fmt
    assert res == expected, res
AssertionError: 
            
            html=4200000
            url=4200000
            multi=4200000
            dollars=$4200000
            cents=$4200000.00
            dollars,=$4,200,000
            cents,=$4,200,000.00
            
            html=None
            url=None
            multi=None
            dollars=
            cents=
            dollars,=
            cents,=
            
            html=&lt;a href=&quot;spam&quot;&gt;
foo bar
            url=%3Ca%20href%3D%22spam%22%3E%0Afoo%20bar
            multi=<a href="spam"><br>
foo bar
            dollars=
            cents=
            dollars,=
            cents,=

======================================================================
FAIL: test_isConstructionAllowed_wo_Security (test_TypesTool.FTIConstructionTests)
----------------------------------------------------------------------
Traceback (most recent call last):
  File "test_TypesTool.py", line 342, in test_isConstructionAllowed_wo_Security
  File "/usr/local/lib/python2.2/unittest.py", line 258, in failIf
    if expr: raise self.failureException, msg
AssertionError

======================================================================
FAIL: test_constructInstance_wo_Roles (test_TypesTool.FTIConstructionTests_w_Roles)
----------------------------------------------------------------------
Traceback (most recent call last):
  File "test_TypesTool.py", line 393, in test_constructInstance_wo_Roles
  File "/usr/local/lib/python2.2/unittest.py", line 279, in failUnlessRaises
    raise self.failureException, excName
AssertionError: Unauthorized

======================================================================
FAIL: test_isConstructionAllowed_wo_Role (test_TypesTool.FTIConstructionTests_w_Roles)
----------------------------------------------------------------------
Traceback (most recent call last):
  File "test_TypesTool.py", line 383, in test_isConstructionAllowed_wo_Role
  File "/usr/local/lib/python2.2/unittest.py", line 279, in failUnlessRaises
    raise self.failureException, excName
AssertionError: Unauthorized

----------------------------------------------------------------------
Ran 870 tests in 109.578s

FAILED (failures=48, errors=46)

======================================================================
OVERALL FAILED (total failures=48, total errors=46)