[Zope-Coders] Zope test results

background@shane.zope.com background@shane.zope.com
Fri, 5 Jul 2002 22:23:32 -0400 (EDT)


Zope2 tests include the ZEO and bsddb3Storage packages.

**********************************************************************
Zope CVS Head with Python 2.1.3
**********************************************************************
FullTest.checkVersionIterator() temporarily disabled.
======================================================================
FAIL: checkPackAllRevisions (testZEO.ZEOFileStorageTests)
----------------------------------------------------------------------
Traceback (most recent call last):
  File "/home/background/zopetest/lib/python/ZODB/tests/PackableStorage.py", line 166, in checkPackAllRevisions
    raises(KeyError, self._storage.loadSerial, oid, revid1)
  File "/usr/lib/python2.1/unittest.py", line 266, in failUnlessRaises
    raise self.failureException, excName
AssertionError: KeyError
======================================================================
FAIL: checkPackJustOldRevisions (testZEO.ZEOFileStorageTests)
----------------------------------------------------------------------
Traceback (most recent call last):
  File "/home/background/zopetest/lib/python/ZODB/tests/PackableStorage.py", line 220, in checkPackJustOldRevisions
    raises(KeyError, self._storage.loadSerial, oid, revid1)
  File "/usr/lib/python2.1/unittest.py", line 266, in failUnlessRaises
    raise self.failureException, excName
AssertionError: KeyError
======================================================================
FAIL: checkPackOnlyOneObject (testZEO.ZEOFileStorageTests)
----------------------------------------------------------------------
Traceback (most recent call last):
  File "/home/background/zopetest/lib/python/ZODB/tests/PackableStorage.py", line 297, in checkPackOnlyOneObject
    raises(KeyError, self._storage.loadSerial, oid1, revid1)
  File "/usr/lib/python2.1/unittest.py", line 266, in failUnlessRaises
    raise self.failureException, excName
AssertionError: KeyError
----------------------------------------------------------------------
Ran 1762 tests in 278.053s

FAILED (failures=3)

======================================================================
OVERALL FAILED (total failures=3)

**********************************************************************
Zope 2.5 branch with Python 2.1.3
**********************************************************************
FullTest.checkVersionIterator() temporarily disabled.
======================================================================
FAIL: checkPackAllRevisions (testZEO.ZEOFileStorageTests)
----------------------------------------------------------------------
Traceback (most recent call last):
  File "/home/background/zopetest/lib/python/ZODB/tests/PackableStorage.py", line 166, in checkPackAllRevisions
    raises(KeyError, self._storage.loadSerial, oid, revid1)
  File "/usr/lib/python2.1/unittest.py", line 266, in failUnlessRaises
    raise self.failureException, excName
AssertionError: KeyError
======================================================================
FAIL: checkPackJustOldRevisions (testZEO.ZEOFileStorageTests)
----------------------------------------------------------------------
Traceback (most recent call last):
  File "/home/background/zopetest/lib/python/ZODB/tests/PackableStorage.py", line 220, in checkPackJustOldRevisions
    raises(KeyError, self._storage.loadSerial, oid, revid1)
  File "/usr/lib/python2.1/unittest.py", line 266, in failUnlessRaises
    raise self.failureException, excName
AssertionError: KeyError
======================================================================
FAIL: checkPackOnlyOneObject (testZEO.ZEOFileStorageTests)
----------------------------------------------------------------------
Traceback (most recent call last):
  File "/home/background/zopetest/lib/python/ZODB/tests/PackableStorage.py", line 297, in checkPackOnlyOneObject
    raises(KeyError, self._storage.loadSerial, oid1, revid1)
  File "/usr/lib/python2.1/unittest.py", line 266, in failUnlessRaises
    raise self.failureException, excName
AssertionError: KeyError
======================================================================
FAIL: checkTransactionalUndoAfterPack (testZEO.ZEOFileStorageTests)
----------------------------------------------------------------------
Traceback (most recent call last):
  File "/home/background/zopetest/lib/python/ZODB/tests/TransactionalUndoStorage.py", line 452, in checkTransactionalUndoAfterPack
    eq(len(info2), 2)
  File "/usr/lib/python2.1/unittest.py", line 273, in failUnlessEqual
    raise self.failureException, (msg or '%s != %s' % (first, second))
AssertionError: 3 != 2
======================================================================
FAIL: checkUndoAbortVersion (testZEO.ZEOFileStorageTests)
----------------------------------------------------------------------
Traceback (most recent call last):
  File "/home/background/zopetest/lib/python/ZODB/tests/TransactionalUndoVersionStorage.py", line 229, in checkUndoAbortVersion
    self.assertEqual(load_value(oid1, version), 0)
  File "/usr/lib/python2.1/unittest.py", line 273, in failUnlessEqual
    raise self.failureException, (msg or '%s != %s' % (first, second))
AssertionError: 2 != 0
----------------------------------------------------------------------
Ran 1762 tests in 278.026s

FAILED (failures=5)

======================================================================
OVERALL FAILED (total failures=5)

**********************************************************************
Zope CVS Head with Python 2.2.1
**********************************************************************
FullTest.checkVersionIterator() temporarily disabled.
======================================================================
FAIL: checkPackAllRevisions (testZEO.ZEOFileStorageTests)
----------------------------------------------------------------------
Traceback (most recent call last):
  File "/home/background/zopetest/lib/python/ZODB/tests/PackableStorage.py", line 166, in checkPackAllRevisions
    raises(KeyError, self._storage.loadSerial, oid, revid1)
  File "/usr/local/lib/python2.2/unittest.py", line 279, in failUnlessRaises
    raise self.failureException, excName
AssertionError: KeyError

======================================================================
FAIL: checkPackJustOldRevisions (testZEO.ZEOFileStorageTests)
----------------------------------------------------------------------
Traceback (most recent call last):
  File "/home/background/zopetest/lib/python/ZODB/tests/PackableStorage.py", line 220, in checkPackJustOldRevisions
    raises(KeyError, self._storage.loadSerial, oid, revid1)
  File "/usr/local/lib/python2.2/unittest.py", line 279, in failUnlessRaises
    raise self.failureException, excName
AssertionError: KeyError

======================================================================
FAIL: checkPackOnlyOneObject (testZEO.ZEOFileStorageTests)
----------------------------------------------------------------------
Traceback (most recent call last):
  File "/home/background/zopetest/lib/python/ZODB/tests/PackableStorage.py", line 297, in checkPackOnlyOneObject
    raises(KeyError, self._storage.loadSerial, oid1, revid1)
  File "/usr/local/lib/python2.2/unittest.py", line 279, in failUnlessRaises
    raise self.failureException, excName
AssertionError: KeyError

======================================================================
FAIL: checkTransactionalUndoAfterPack (testZEO.ZEOFileStorageTests)
----------------------------------------------------------------------
Traceback (most recent call last):
  File "/home/background/zopetest/lib/python/ZODB/tests/TransactionalUndoStorage.py", line 452, in checkTransactionalUndoAfterPack
    eq(len(info2), 2)
  File "/usr/local/lib/python2.2/unittest.py", line 286, in failUnlessEqual
    raise self.failureException, \
AssertionError: 3 != 2

----------------------------------------------------------------------
Ran 1764 tests in 276.569s

FAILED (failures=4)

======================================================================
OVERALL FAILED (total failures=4)