[Zope-Coders] Zope test results
background@shane.zope.com
background@shane.zope.com
Thu, 6 Jun 2002 22:24:14 -0400 (EDT)
Zope2 tests include the ZEO and bsddb3Storage packages.
**********************************************************************
Zope CVS Head with Python 2.1.3
**********************************************************************
FullTest.checkVersionIterator() temporarily disabled.
======================================================================
ERROR: Check that the client reconnects when a server restarts.
----------------------------------------------------------------------
Traceback (most recent call last):
File "testZEO.py", line 399, in checkReconnection
File "testZEO.py", line 102, in _dostore
File "/home/background/zopetest/lib/python/ZEO/ClientStorage.py", line 462, in tpc_finish
transaction._extension)
File "/home/background/zopetest/lib/python/ZEO/zrpc.py", line 168, in __call__
raise r[0], r[1] # see server log for real traceback
AttributeError: 'None' object has no attribute 'id'
======================================================================
FAIL: checkDetail (testCache.LRUCacheTests)
----------------------------------------------------------------------
Traceback (most recent call last):
File "testCache.py", line 201, in checkDetail
File "/usr/lib/python2.1/unittest.py", line 273, in failUnlessEqual
raise self.failureException, (msg or '%s != %s' % (first, second))
AssertionError: 4 != 3
----------------------------------------------------------------------
Ran 1413 tests in 299.899s
FAILED (failures=1, errors=1)
======================================================================
OVERALL FAILED (total failures=1, total errors=1)
**********************************************************************
Zope 2.5 branch with Python 2.1.3
**********************************************************************
FullTest.checkVersionIterator() temporarily disabled.
----------------------------------------------------------------------
Ran 1413 tests in 292.099s
OK
**********************************************************************
Zope CVS Head with Python 2.2.1
**********************************************************************
FullTest.checkVersionIterator() temporarily disabled.
----------------------------------------------------------------------
Ran 1415 tests in 286.888s
OK