[Zope-Coders] Zope test results
background@shane.zope.com
background@shane.zope.com
Fri, 7 Jun 2002 22:24:06 -0400 (EDT)
Zope2 tests include the ZEO and bsddb3Storage packages.
**********************************************************************
Zope CVS Head with Python 2.1.3
**********************************************************************
FullTest.checkVersionIterator() temporarily disabled.
======================================================================
ERROR: testModule (testVerify.Test)
----------------------------------------------------------------------
Traceback (most recent call last):
File "testVerify.py", line 149, in testModule
ImportError: No module named tests.IFoo
======================================================================
ERROR: testBlech (testDocument.Test)
----------------------------------------------------------------------
Traceback (most recent call last):
File "testDocument.py", line 27, in testBlech
ImportError: No module named Document
======================================================================
FAIL: checkDetail (testCache.LRUCacheTests)
----------------------------------------------------------------------
Traceback (most recent call last):
File "testCache.py", line 201, in checkDetail
File "/usr/lib/python2.1/unittest.py", line 273, in failUnlessEqual
raise self.failureException, (msg or '%s != %s' % (first, second))
AssertionError: 4 != 3
----------------------------------------------------------------------
Ran 1435 tests in 302.026s
FAILED (failures=1, errors=2)
======================================================================
OVERALL FAILED (total failures=1, total errors=2)
**********************************************************************
Zope 2.5 branch with Python 2.1.3
**********************************************************************
FullTest.checkVersionIterator() temporarily disabled.
======================================================================
ERROR: testModule (testVerify.Test)
----------------------------------------------------------------------
Traceback (most recent call last):
File "testVerify.py", line 149, in testModule
ImportError: No module named tests.IFoo
======================================================================
ERROR: testBlech (testDocument.Test)
----------------------------------------------------------------------
Traceback (most recent call last):
File "testDocument.py", line 27, in testBlech
ImportError: No module named Document
----------------------------------------------------------------------
Ran 1435 tests in 289.524s
FAILED (errors=2)
======================================================================
OVERALL FAILED (total errors=2)
**********************************************************************
Zope CVS Head with Python 2.2.1
**********************************************************************
Module testExceptionFormatter.py failed to load
exceptions.AttributeError: PageTemplates
File "utilities/testrunner.py", line 60, in getSuiteFromFile
File "testExceptionFormatter.py", line 26, in ?
from Zope.Testing.CleanUp import CleanUp # Base class w registry cleanup
File "/home/background/zopetest/lib/python/Zope/__init__.py", line 71, in ?
OFS.Application.initialize(c)
File "/home/background/zopetest/lib/python/OFS/Application.py", line 420, in initialize
install_standards(app)
File "/home/background/zopetest/lib/python/OFS/Application.py", line 728, in install_standards
app.manage_addProduct['PageTemplates'].manage_addPageTemplate(
File "/home/background/zopetest/lib/python/App/FactoryDispatcher.py", line 26, in __getitem__
return self.__bobo_traverse__(None, name)
File "/home/background/zopetest/lib/python/App/FactoryDispatcher.py", line 29, in __bobo_traverse__
product=self.aq_acquire('_getProducts')()._product(name)
File "/home/background/zopetest/lib/python/App/Product.py", line 65, in _product
def _product(self, name): return getattr(self, name)
FullTest.checkVersionIterator() temporarily disabled.
======================================================================
ERROR: testModule (testVerify.Test)
----------------------------------------------------------------------
Traceback (most recent call last):
File "testVerify.py", line 149, in testModule
ImportError: No module named tests.IFoo
======================================================================
ERROR: testBlech (testDocument.Test)
----------------------------------------------------------------------
Traceback (most recent call last):
File "testDocument.py", line 27, in testBlech
ImportError: No module named Document
======================================================================
ERROR: testing And (catalog)
----------------------------------------------------------------------
Traceback (most recent call last):
File "testTopicIndex.py", line 94, in setUp
File "/home/background/zopetest/lib/python/Products/ZCatalog/ZCatalog.py", line 184, in __init__
self.addIndex('id', 'FieldIndex')
File "/home/background/zopetest/lib/python/Products/ZCatalog/ZCatalog.py", line 836, in addIndex
raise ValueError, "Index of type %s not found" % type
ValueError: Index of type FieldIndex not found
======================================================================
ERROR: testing or (catalog)
----------------------------------------------------------------------
Traceback (most recent call last):
File "testTopicIndex.py", line 94, in setUp
File "/home/background/zopetest/lib/python/Products/ZCatalog/ZCatalog.py", line 184, in __init__
self.addIndex('id', 'FieldIndex')
File "/home/background/zopetest/lib/python/Products/ZCatalog/ZCatalog.py", line 836, in addIndex
raise ValueError, "Index of type %s not found" % type
ValueError: Index of type FieldIndex not found
======================================================================
ERROR: testInstantiateWithGlobbingVocab (testCatalog.TestZCatalogObject)
----------------------------------------------------------------------
Traceback (most recent call last):
File "testCatalog.py", line 146, in testInstantiateWithGlobbingVocab
File "/home/background/zopetest/lib/python/Products/ZCatalog/ZCatalog.py", line 184, in __init__
self.addIndex('id', 'FieldIndex')
File "/home/background/zopetest/lib/python/Products/ZCatalog/ZCatalog.py", line 836, in addIndex
raise ValueError, "Index of type %s not found" % type
ValueError: Index of type FieldIndex not found
======================================================================
ERROR: testInstantiateWithNormalVocab (testCatalog.TestZCatalogObject)
----------------------------------------------------------------------
Traceback (most recent call last):
File "testCatalog.py", line 154, in testInstantiateWithNormalVocab
File "/home/background/zopetest/lib/python/Products/ZCatalog/ZCatalog.py", line 184, in __init__
self.addIndex('id', 'FieldIndex')
File "/home/background/zopetest/lib/python/Products/ZCatalog/ZCatalog.py", line 836, in addIndex
raise ValueError, "Index of type %s not found" % type
ValueError: Index of type FieldIndex not found
======================================================================
ERROR: testInstantiateWithoutVocab (testCatalog.TestZCatalogObject)
----------------------------------------------------------------------
Traceback (most recent call last):
File "testCatalog.py", line 138, in testInstantiateWithoutVocab
File "/home/background/zopetest/lib/python/Products/ZCatalog/ZCatalog.py", line 184, in __init__
self.addIndex('id', 'FieldIndex')
File "/home/background/zopetest/lib/python/Products/ZCatalog/ZCatalog.py", line 836, in addIndex
raise ValueError, "Index of type %s not found" % type
ValueError: Index of type FieldIndex not found
======================================================================
FAIL: testExprExplicitDeny (testSecurity.SecurityTests)
----------------------------------------------------------------------
Traceback (most recent call last):
File "testSecurity.py", line 59, in testExprExplicitDeny
File "/usr/local/lib/python2.2/unittest.py", line 279, in failUnlessRaises
raise self.failureException, excName
AssertionError: Unauthorized
----------------------------------------------------------------------
Ran 1429 tests in 293.971s
FAILED (failures=1, errors=7)
======================================================================
OVERALL FAILED (total failures=1, total errors=7)