[Zope-Coders] FYI: 2.6 a1 today
Jeremy Hylton
jeremy@zope.com
Fri, 14 Jun 2002 16:38:49 -0400
All the failures I see are in range searches (I think).
Jeremy
...E.................E................E................E................F.........E....F.........E....F.........E.....F.......F..E...E.................E.................E.................E......................F...........F........E............F...........F........E............F............F........E............F.............F........E...................................................................................................................................
======================================================================
ERROR: testEmptyRangeSearches (testBTrees.TestIOSets)
----------------------------------------------------------------------
Traceback (most recent call last):
File "testBTrees.py", line 440, in testEmptyRangeSearches
SystemError: ../Objects/listobject.c:33: bad argument to internal function
======================================================================
ERROR: testEmptyRangeSearches (testBTrees.TestOOSets)
----------------------------------------------------------------------
Traceback (most recent call last):
File "testBTrees.py", line 440, in testEmptyRangeSearches
SystemError: ../Objects/listobject.c:33: bad argument to internal function
======================================================================
ERROR: testEmptyRangeSearches (testBTrees.TestOISets)
----------------------------------------------------------------------
Traceback (most recent call last):
File "testBTrees.py", line 440, in testEmptyRangeSearches
SystemError: ../Objects/listobject.c:33: bad argument to internal function
======================================================================
ERROR: testEmptyRangeSearches (testBTrees.TestIISets)
----------------------------------------------------------------------
Traceback (most recent call last):
File "testBTrees.py", line 440, in testEmptyRangeSearches
SystemError: ../Objects/listobject.c:33: bad argument to internal function
======================================================================
ERROR: testSlicing (testBTrees.TestIOTreeSets)
----------------------------------------------------------------------
Traceback (most recent call last):
File "testBTrees.py", line 467, in testSlicing
IndexError: 0
======================================================================
ERROR: testSlicing (testBTrees.TestOOTreeSets)
----------------------------------------------------------------------
Traceback (most recent call last):
File "testBTrees.py", line 467, in testSlicing
IndexError: 0
======================================================================
ERROR: testSlicing (testBTrees.TestOITreeSets)
----------------------------------------------------------------------
Traceback (most recent call last):
File "testBTrees.py", line 467, in testSlicing
IndexError: 0
======================================================================
ERROR: testSlicing (testBTrees.TestIITreeSets)
----------------------------------------------------------------------
Traceback (most recent call last):
File "testBTrees.py", line 467, in testSlicing
IndexError: 0
======================================================================
ERROR: testEmptyRangeSearches (testBTrees.TestIOBuckets)
----------------------------------------------------------------------
Traceback (most recent call last):
File "testBTrees.py", line 253, in testEmptyRangeSearches
SystemError: ../Objects/listobject.c:33: bad argument to internal function
======================================================================
ERROR: testEmptyRangeSearches (testBTrees.TestOOBuckets)
----------------------------------------------------------------------
Traceback (most recent call last):
File "testBTrees.py", line 253, in testEmptyRangeSearches
SystemError: ../Objects/listobject.c:33: bad argument to internal function
======================================================================
ERROR: testEmptyRangeSearches (testBTrees.TestOIBuckets)
----------------------------------------------------------------------
Traceback (most recent call last):
File "testBTrees.py", line 253, in testEmptyRangeSearches
SystemError: ../Objects/listobject.c:33: bad argument to internal function
======================================================================
ERROR: testEmptyRangeSearches (testBTrees.TestIIBuckets)
----------------------------------------------------------------------
Traceback (most recent call last):
File "testBTrees.py", line 253, in testEmptyRangeSearches
SystemError: ../Objects/listobject.c:33: bad argument to internal function
======================================================================
ERROR: testSlicing (testBTrees.TestIOBTrees)
----------------------------------------------------------------------
Traceback (most recent call last):
File "testBTrees.py", line 294, in testSlicing
IndexError: 0
======================================================================
ERROR: testSlicing (testBTrees.TestOOBTrees)
----------------------------------------------------------------------
Traceback (most recent call last):
File "testBTrees.py", line 294, in testSlicing
IndexError: 0
======================================================================
ERROR: testSlicing (testBTrees.TestOIBTrees)
----------------------------------------------------------------------
Traceback (most recent call last):
File "testBTrees.py", line 294, in testSlicing
IndexError: 0
======================================================================
ERROR: testSlicing (testBTrees.TestIIBTrees)
----------------------------------------------------------------------
Traceback (most recent call last):
File "testBTrees.py", line 294, in testSlicing
IndexError: 0
======================================================================
FAIL: testEmptyRangeSearches (testBTrees.TestIOTreeSets)
----------------------------------------------------------------------
Traceback (most recent call last):
File "testBTrees.py", line 447, in testEmptyRangeSearches
File "/usr/local/lib/python2.1/unittest.py", line 273, in failUnlessEqual
raise self.failureException, (msg or '%s != %s' % (first, second))
AssertionError: 61 != 0
======================================================================
FAIL: testEmptyRangeSearches (testBTrees.TestOOTreeSets)
----------------------------------------------------------------------
Traceback (most recent call last):
File "testBTrees.py", line 447, in testEmptyRangeSearches
File "/usr/local/lib/python2.1/unittest.py", line 273, in failUnlessEqual
raise self.failureException, (msg or '%s != %s' % (first, second))
AssertionError: 76 != 0
======================================================================
FAIL: testEmptyRangeSearches (testBTrees.TestOITreeSets)
----------------------------------------------------------------------
Traceback (most recent call last):
File "testBTrees.py", line 447, in testEmptyRangeSearches
File "/usr/local/lib/python2.1/unittest.py", line 273, in failUnlessEqual
raise self.failureException, (msg or '%s != %s' % (first, second))
AssertionError: 61 != 0
======================================================================
FAIL: testEmptyRangeSearches (testBTrees.TestIITreeSets)
----------------------------------------------------------------------
Traceback (most recent call last):
File "testBTrees.py", line 447, in testEmptyRangeSearches
File "/usr/local/lib/python2.1/unittest.py", line 273, in failUnlessEqual
raise self.failureException, (msg or '%s != %s' % (first, second))
AssertionError: 31 != 0
======================================================================
FAIL: testRanges (testBTrees.TestIITreeSets)
----------------------------------------------------------------------
Traceback (most recent call last):
File "testBTrees.py", line 996, in testRanges
File "testBTrees.py", line 992, in _checkRanges
File "/usr/local/lib/python2.1/unittest.py", line 273, in failUnlessEqual
raise self.failureException, (msg or '%s != %s' % (first, second))
AssertionError: [1] != []
======================================================================
FAIL: testEmptyRangeSearches (testBTrees.TestIOBTrees)
----------------------------------------------------------------------
Traceback (most recent call last):
File "testBTrees.py", line 260, in testEmptyRangeSearches
File "/usr/local/lib/python2.1/unittest.py", line 273, in failUnlessEqual
raise self.failureException, (msg or '%s != %s' % (first, second))
AssertionError: 61 != 0
======================================================================
FAIL: testPathologicalRangeSearch (testBTrees.TestIOBTrees)
----------------------------------------------------------------------
Traceback (most recent call last):
File "testBTrees.py", line 733, in testPathologicalRangeSearch
File "/usr/local/lib/python2.1/unittest.py", line 273, in failUnlessEqual
raise self.failureException, (msg or '%s != %s' % (first, second))
AssertionError: 0 != 30
======================================================================
FAIL: testEmptyRangeSearches (testBTrees.TestOOBTrees)
----------------------------------------------------------------------
Traceback (most recent call last):
File "testBTrees.py", line 260, in testEmptyRangeSearches
File "/usr/local/lib/python2.1/unittest.py", line 273, in failUnlessEqual
raise self.failureException, (msg or '%s != %s' % (first, second))
AssertionError: 76 != 0
======================================================================
FAIL: testPathologicalRangeSearch (testBTrees.TestOOBTrees)
----------------------------------------------------------------------
Traceback (most recent call last):
File "testBTrees.py", line 733, in testPathologicalRangeSearch
File "/usr/local/lib/python2.1/unittest.py", line 273, in failUnlessEqual
raise self.failureException, (msg or '%s != %s' % (first, second))
AssertionError: 0 != 15
======================================================================
FAIL: testEmptyRangeSearches (testBTrees.TestOIBTrees)
----------------------------------------------------------------------
Traceback (most recent call last):
File "testBTrees.py", line 260, in testEmptyRangeSearches
File "/usr/local/lib/python2.1/unittest.py", line 273, in failUnlessEqual
raise self.failureException, (msg or '%s != %s' % (first, second))
AssertionError: 61 != 0
======================================================================
FAIL: testPathologicalRangeSearch (testBTrees.TestOIBTrees)
----------------------------------------------------------------------
Traceback (most recent call last):
File "testBTrees.py", line 733, in testPathologicalRangeSearch
File "/usr/local/lib/python2.1/unittest.py", line 273, in failUnlessEqual
raise self.failureException, (msg or '%s != %s' % (first, second))
AssertionError: 0 != 30
======================================================================
FAIL: testEmptyRangeSearches (testBTrees.TestIIBTrees)
----------------------------------------------------------------------
Traceback (most recent call last):
File "testBTrees.py", line 260, in testEmptyRangeSearches
File "/usr/local/lib/python2.1/unittest.py", line 273, in failUnlessEqual
raise self.failureException, (msg or '%s != %s' % (first, second))
AssertionError: 31 != 0
======================================================================
FAIL: testPathologicalRangeSearch (testBTrees.TestIIBTrees)
----------------------------------------------------------------------
Traceback (most recent call last):
File "testBTrees.py", line 733, in testPathologicalRangeSearch
File "/usr/local/lib/python2.1/unittest.py", line 273, in failUnlessEqual
raise self.failureException, (msg or '%s != %s' % (first, second))
AssertionError: 0 != 60
----------------------------------------------------------------------
Ran 468 tests in 16.880s
FAILED (failures=13, errors=16)
======================================================================
OVERALL FAILED (total failures=13, total errors=16)