[Zope-Coders] Zope test results

background@shane.zope.com background@shane.zope.com
Wed, 1 May 2002 22:24:23 -0400 (EDT)


Zope2 tests include the ZEO and bsddb3Storage packages.

**********************************************************************
Zope CVS Head with Python 2.1.3
**********************************************************************
FullTest.checkVersionIterator() temporarily disabled.
======================================================================
FAIL: checkLRU (testCache.LRUCacheTests)
----------------------------------------------------------------------
Traceback (most recent call last):
  File "testCache.py", line 146, in checkLRU
  File "/usr/lib/python2.1/unittest.py", line 273, in failUnlessEqual
    raise self.failureException, (msg or '%s != %s' % (first, second))
AssertionError: None != 0
----------------------------------------------------------------------
Ran 1401 tests in 301.742s

FAILED (failures=1)

======================================================================
OVERALL FAILED (total failures=1)

**********************************************************************
Zope 2.5 branch with Python 2.1.3
**********************************************************************
FullTest.checkVersionIterator() temporarily disabled.
======================================================================
FAIL: checkLRU (testCache.LRUCacheTests)
----------------------------------------------------------------------
Traceback (most recent call last):
  File "testCache.py", line 146, in checkLRU
  File "/usr/lib/python2.1/unittest.py", line 273, in failUnlessEqual
    raise self.failureException, (msg or '%s != %s' % (first, second))
AssertionError: None != 0
----------------------------------------------------------------------
Ran 1401 tests in 301.833s

FAILED (failures=1)

======================================================================
OVERALL FAILED (total failures=1)

**********************************************************************
Zope CVS Head with Python 2.2.1 (plus distutils-config-branch)
**********************************************************************
FullTest.checkVersionIterator() temporarily disabled.
----------------------------------------------------------------------
Ran 1403 tests in 290.086s

OK