[Zope-Coders] Win32 Test Results failures:7

zope-tests@squishdot.org zope-tests@squishdot.org
Wed, 08 May 2002 02:14:58 +0100


==============================================================================
==============================================================================
Python Version:2.1.2 (#31, Jan 15 2002, 17:28:11) [MSC 32 bit (Intel)]

Modules included:
Zope (HEAD)
CMF/CMFCore (HEAD)
CMF/CMFCalendar (HEAD)
CMF/CMFCollector (HEAD)
CMF/CMFDecor (HEAD)
CMF/CMFDefault (HEAD)
CMF/CMFTopic (HEAD)
CMF/CMFTracker (HEAD)
CMF/CMFWiki (HEAD)
CMF/DCWorkflow (HEAD)

======================================================================
FAIL: test_ctor (Products.CMFCore.tests.test_FSImage.FSImageTests)
----------------------------------------------------------------------
Traceback (most recent call last):
  File "E:\ZopeTests\sandbox\Zope\lib\python\Products\CMFCore\tests\test_FSImage.py", line 41, in test_ctor
    self.assertEqual( image.get_size(), len( ref ) )
  File "c:\python21\lib\unittest.py", line 273, in failUnlessEqual
    raise self.failureException, (msg or '%s != %s' % (first, second))
AssertionError: 209 != 98
======================================================================
FAIL: test_index_html (Products.CMFCore.tests.test_FSImage.FSImageTests)
----------------------------------------------------------------------
Traceback (most recent call last):
  File "E:\ZopeTests\sandbox\Zope\lib\python\Products\CMFCore\tests\test_FSImage.py", line 58, in test_index_html
    self.assertEqual( len( data ), len( ref ) )
  File "c:\python21\lib\unittest.py", line 273, in failUnlessEqual
    raise self.failureException, (msg or '%s != %s' % (first, second))
AssertionError: 209 != 98
======================================================================
FAIL: test_ctor (test_FSImage.FSImageTests)
----------------------------------------------------------------------
Traceback (most recent call last):
  File "E:\ZopeTests\sandbox\Zope\lib\python\Products\CMFCore\tests\test_FSImage.py", line 41, in test_ctor
    self.assertEqual( image.get_size(), len( ref ) )
  File "c:\python21\lib\unittest.py", line 273, in failUnlessEqual
    raise self.failureException, (msg or '%s != %s' % (first, second))
AssertionError: 209 != 98
======================================================================
FAIL: test_index_html (test_FSImage.FSImageTests)
----------------------------------------------------------------------
Traceback (most recent call last):
  File "E:\ZopeTests\sandbox\Zope\lib\python\Products\CMFCore\tests\test_FSImage.py", line 58, in test_index_html
    self.assertEqual( len( data ), len( ref ) )
  File "c:\python21\lib\unittest.py", line 273, in failUnlessEqual
    raise self.failureException, (msg or '%s != %s' % (first, second))
AssertionError: 209 != 98
======================================================================
FAIL: checkTransactionalUndoAfterPack (testFileStorage.FileStorageTests)
----------------------------------------------------------------------
Traceback (most recent call last):
  File "E:\ZopeTests\sandbox\Zope\lib\python\ZODB\tests\TransactionalUndoStorage.py", line 448, in checkTransactionalUndoAfterPack
    eq(len(info2), 2)
  File "c:\python21\lib\unittest.py", line 273, in failUnlessEqual
    raise self.failureException, (msg or '%s != %s' % (first, second))
AssertionError: 3 != 2
----------------------------------------------------------------------
Ran 1688 tests in 234.767s

FAILED (failures=5)

======================================================================
OVERALL FAILED (total failures=5)
==============================================================================
==============================================================================
Python Version:2.1.2 (#31, Jan 15 2002, 17:28:11) [MSC 32 bit (Intel)]

Modules included:
Zope (Zope-2_5-branch)

======================================================================
FAIL: check_simple_html (test_xmlparser.XMLParserTestCase)
----------------------------------------------------------------------
Traceback (most recent call last):
  File "test_xmlparser.py", line 114, in check_simple_html
  File "test_xmlparser.py", line 95, in _run_check
  File "c:\python21\lib\unittest.py", line 249, in failUnless
    if not expr: raise self.failureException, msg
AssertionError: [('starttag', u'html', []), ('data', u' \n'), ('comment', u'comment1a\n-></foo><bar>&lt;<?pi?></foo<bar\ncomment1b'), ('data', u'\n'), ('starttag', u'img', [u'src', u'Bar', u'ismap', u'']), ('endtag', u'img'), ('data', u'sample\ntext\n'), ('comment', u'comment2a- -comment2b'), ('data', u'\n'), ('endtag', u'html')]
======================================================================
FAIL: checkTransactionalUndoAfterPack (testFileStorage.FileStorageTests)
----------------------------------------------------------------------
Traceback (most recent call last):
  File "E:\ZopeTests\sandbox\Zope\lib\python\ZODB\tests\TransactionalUndoStorage.py", line 448, in checkTransactionalUndoAfterPack
    eq(len(info2), 2)
  File "c:\python21\lib\unittest.py", line 273, in failUnlessEqual
    raise self.failureException, (msg or '%s != %s' % (first, second))
AssertionError: 3 != 2
----------------------------------------------------------------------
Ran 1158 tests in 190.494s

FAILED (failures=2)

======================================================================
OVERALL FAILED (total failures=2)