[Zope-Coders] Win32 Test Results failures:5
zope-tests@squishdot.org
zope-tests@squishdot.org
Thu, 23 May 2002 02:16:11 +0100
==============================================================================
==============================================================================
Python Version:2.1.2 (#31, Jan 15 2002, 17:28:11) [MSC 32 bit (Intel)]
Modules included:
Zope (HEAD)
CMF/CMFCore (HEAD)
CMF/CMFCalendar (HEAD)
CMF/CMFCollector (HEAD)
CMF/CMFDecor (HEAD)
CMF/CMFDefault (HEAD)
CMF/CMFTopic (HEAD)
CMF/CMFTracker (HEAD)
CMF/CMFWiki (HEAD)
CMF/DCWorkflow (HEAD)
======================================================================
FAIL: test_fmt (testSecurity.SecurityTests)
----------------------------------------------------------------------
Traceback (most recent call last):
File "E:\ZopeTests\sandbox\Zope\lib\python\DocumentTemplate\tests\testDTML.py", line 295, in test_fmt
assert res == expected, res
AssertionError:
4200000
html=4200000
url=4200000
multi=4200000
dollars=$4200000
cents=$4200000.00
dollars,=$4,200,000
cents,=$4,200,000.00
None
html=None
url=None
multi=None
dollars=
cents=
dollars,=
cents,=
<a href="spam">
foo bar
html=<a href="spam">
foo bar
url=%3Ca%20href%3D%22spam%22%3E%0Afoo%20bar
multi=<a href="spam"><br />
foo bar
dollars=
cents=
dollars,=
cents,=
======================================================================
FAIL: test_fmt (testUserFolder.SecurityTests)
----------------------------------------------------------------------
Traceback (most recent call last):
File "E:\ZopeTests\sandbox\Zope\lib\python\DocumentTemplate\tests\testDTML.py", line 295, in test_fmt
assert res == expected, res
AssertionError:
4200000
html=4200000
url=4200000
multi=4200000
dollars=$4200000
cents=$4200000.00
dollars,=$4,200,000
cents,=$4,200,000.00
None
html=None
url=None
multi=None
dollars=
cents=
dollars,=
cents,=
<a href="spam">
foo bar
html=<a href="spam">
foo bar
url=%3Ca%20href%3D%22spam%22%3E%0Afoo%20bar
multi=<a href="spam"><br />
foo bar
dollars=
cents=
dollars,=
cents,=
======================================================================
FAIL: test_fmt (testDTML.DTMLTests)
----------------------------------------------------------------------
Traceback (most recent call last):
File "E:\ZopeTests\sandbox\Zope\lib\python\DocumentTemplate\tests\testDTML.py", line 295, in test_fmt
assert res == expected, res
AssertionError:
4200000
html=4200000
url=4200000
multi=4200000
dollars=$4200000
cents=$4200000.00
dollars,=$4,200,000
cents,=$4,200,000.00
None
html=None
url=None
multi=None
dollars=
cents=
dollars,=
cents,=
<a href="spam">
foo bar
html=<a href="spam">
foo bar
url=%3Ca%20href%3D%22spam%22%3E%0Afoo%20bar
multi=<a href="spam"><br />
foo bar
dollars=
cents=
dollars,=
cents,=
======================================================================
FAIL: checkTransactionalUndoAfterPack (testFileStorage.FileStorageTests)
----------------------------------------------------------------------
Traceback (most recent call last):
File "E:\ZopeTests\sandbox\Zope\lib\python\ZODB\tests\TransactionalUndoStorage.py", line 448, in checkTransactionalUndoAfterPack
eq(len(info2), 2)
File "c:\python21\lib\unittest.py", line 273, in failUnlessEqual
raise self.failureException, (msg or '%s != %s' % (first, second))
AssertionError: 3 != 2
----------------------------------------------------------------------
Ran 1709 tests in 257.390s
FAILED (failures=4)
======================================================================
OVERALL FAILED (total failures=4)
==============================================================================
==============================================================================
Python Version:2.1.2 (#31, Jan 15 2002, 17:28:11) [MSC 32 bit (Intel)]
Modules included:
Zope (Zope-2_5-branch)
======================================================================
FAIL: checkTransactionalUndoAfterPack (testFileStorage.FileStorageTests)
----------------------------------------------------------------------
Traceback (most recent call last):
File "E:\ZopeTests\sandbox\Zope\lib\python\ZODB\tests\TransactionalUndoStorage.py", line 448, in checkTransactionalUndoAfterPack
eq(len(info2), 2)
File "c:\python21\lib\unittest.py", line 273, in failUnlessEqual
raise self.failureException, (msg or '%s != %s' % (first, second))
AssertionError: 3 != 2
----------------------------------------------------------------------
Ran 1159 tests in 196.473s
FAILED (failures=1)
======================================================================
OVERALL FAILED (total failures=1)