[Zope-Coders] Zope test results
background@shane.zope.com
background@shane.zope.com
Wed, 22 May 2002 22:24:32 -0400 (EDT)
Zope2 tests include the ZEO and bsddb3Storage packages.
**********************************************************************
Zope CVS Head with Python 2.1.3
**********************************************************************
FullTest.checkVersionIterator() temporarily disabled.
======================================================================
FAIL: test_fmt (testUserFolder.SecurityTests)
----------------------------------------------------------------------
Traceback (most recent call last):
File "/home/background/zopetest/lib/python/DocumentTemplate/tests/testDTML.py", line 295, in test_fmt
assert res == expected, res
AssertionError:
4200000
html=4200000
url=4200000
multi=4200000
dollars=$4200000
cents=$4200000.00
dollars,=$4,200,000
cents,=$4,200,000.00
None
html=None
url=None
multi=None
dollars=
cents=
dollars,=
cents,=
<a href="spam">
foo bar
html=<a href="spam">
foo bar
url=%3Ca%20href%3D%22spam%22%3E%0Afoo%20bar
multi=<a href="spam"><br />
foo bar
dollars=
cents=
dollars,=
cents,=
======================================================================
FAIL: test_fmt (testSecurity.SecurityTests)
----------------------------------------------------------------------
Traceback (most recent call last):
File "/home/background/zopetest/lib/python/DocumentTemplate/tests/testDTML.py", line 295, in test_fmt
assert res == expected, res
AssertionError:
4200000
html=4200000
url=4200000
multi=4200000
dollars=$4200000
cents=$4200000.00
dollars,=$4,200,000
cents,=$4,200,000.00
None
html=None
url=None
multi=None
dollars=
cents=
dollars,=
cents,=
<a href="spam">
foo bar
html=<a href="spam">
foo bar
url=%3Ca%20href%3D%22spam%22%3E%0Afoo%20bar
multi=<a href="spam"><br />
foo bar
dollars=
cents=
dollars,=
cents,=
======================================================================
FAIL: test_fmt (testDTML.DTMLTests)
----------------------------------------------------------------------
Traceback (most recent call last):
File "/home/background/zopetest/lib/python/DocumentTemplate/tests/testDTML.py", line 295, in test_fmt
assert res == expected, res
AssertionError:
4200000
html=4200000
url=4200000
multi=4200000
dollars=$4200000
cents=$4200000.00
dollars,=$4,200,000
cents,=$4,200,000.00
None
html=None
url=None
multi=None
dollars=
cents=
dollars,=
cents,=
<a href="spam">
foo bar
html=<a href="spam">
foo bar
url=%3Ca%20href%3D%22spam%22%3E%0Afoo%20bar
multi=<a href="spam"><br />
foo bar
dollars=
cents=
dollars,=
cents,=
----------------------------------------------------------------------
Ran 1402 tests in 295.664s
FAILED (failures=3)
======================================================================
OVERALL FAILED (total failures=3)
**********************************************************************
Zope 2.5 branch with Python 2.1.3
**********************************************************************
FullTest.checkVersionIterator() temporarily disabled.
======================================================================
FAIL: test_fmt (testUserFolder.SecurityTests)
----------------------------------------------------------------------
Traceback (most recent call last):
File "/home/background/zopetest/lib/python/DocumentTemplate/tests/testDTML.py", line 295, in test_fmt
assert res == expected, res
AssertionError:
4200000
html=4200000
url=4200000
multi=4200000
dollars=$4200000
cents=$4200000.00
dollars,=$4,200,000
cents,=$4,200,000.00
None
html=None
url=None
multi=None
dollars=
cents=
dollars,=
cents,=
<a href="spam">
foo bar
html=<a href="spam">
foo bar
url=%3Ca%20href%3D%22spam%22%3E%0Afoo%20bar
multi=<a href="spam"><br />
foo bar
dollars=
cents=
dollars,=
cents,=
======================================================================
FAIL: test_fmt (testSecurity.SecurityTests)
----------------------------------------------------------------------
Traceback (most recent call last):
File "/home/background/zopetest/lib/python/DocumentTemplate/tests/testDTML.py", line 295, in test_fmt
assert res == expected, res
AssertionError:
4200000
html=4200000
url=4200000
multi=4200000
dollars=$4200000
cents=$4200000.00
dollars,=$4,200,000
cents,=$4,200,000.00
None
html=None
url=None
multi=None
dollars=
cents=
dollars,=
cents,=
<a href="spam">
foo bar
html=<a href="spam">
foo bar
url=%3Ca%20href%3D%22spam%22%3E%0Afoo%20bar
multi=<a href="spam"><br />
foo bar
dollars=
cents=
dollars,=
cents,=
======================================================================
FAIL: test_fmt (testDTML.DTMLTests)
----------------------------------------------------------------------
Traceback (most recent call last):
File "/home/background/zopetest/lib/python/DocumentTemplate/tests/testDTML.py", line 295, in test_fmt
assert res == expected, res
AssertionError:
4200000
html=4200000
url=4200000
multi=4200000
dollars=$4200000
cents=$4200000.00
dollars,=$4,200,000
cents,=$4,200,000.00
None
html=None
url=None
multi=None
dollars=
cents=
dollars,=
cents,=
<a href="spam">
foo bar
html=<a href="spam">
foo bar
url=%3Ca%20href%3D%22spam%22%3E%0Afoo%20bar
multi=<a href="spam"><br />
foo bar
dollars=
cents=
dollars,=
cents,=
----------------------------------------------------------------------
Ran 1402 tests in 309.521s
FAILED (failures=3)
======================================================================
OVERALL FAILED (total failures=3)
**********************************************************************
Zope CVS Head with Python 2.2.1
**********************************************************************
FullTest.checkVersionIterator() temporarily disabled.
======================================================================
FAIL: test_fmt (testUserFolder.SecurityTests)
----------------------------------------------------------------------
Traceback (most recent call last):
File "/home/background/zopetest/lib/python/DocumentTemplate/tests/testDTML.py", line 295, in test_fmt
assert res == expected, res
AssertionError:
4200000
html=4200000
url=4200000
multi=4200000
dollars=$4200000
cents=$4200000.00
dollars,=$4,200,000
cents,=$4,200,000.00
None
html=None
url=None
multi=None
dollars=
cents=
dollars,=
cents,=
<a href="spam">
foo bar
html=<a href="spam">
foo bar
url=%3Ca%20href%3D%22spam%22%3E%0Afoo%20bar
multi=<a href="spam"><br />
foo bar
dollars=
cents=
dollars,=
cents,=
======================================================================
FAIL: test_fmt (testSecurity.SecurityTests)
----------------------------------------------------------------------
Traceback (most recent call last):
File "/home/background/zopetest/lib/python/DocumentTemplate/tests/testDTML.py", line 295, in test_fmt
assert res == expected, res
AssertionError:
4200000
html=4200000
url=4200000
multi=4200000
dollars=$4200000
cents=$4200000.00
dollars,=$4,200,000
cents,=$4,200,000.00
None
html=None
url=None
multi=None
dollars=
cents=
dollars,=
cents,=
<a href="spam">
foo bar
html=<a href="spam">
foo bar
url=%3Ca%20href%3D%22spam%22%3E%0Afoo%20bar
multi=<a href="spam"><br />
foo bar
dollars=
cents=
dollars,=
cents,=
======================================================================
FAIL: test_fmt (testDTML.DTMLTests)
----------------------------------------------------------------------
Traceback (most recent call last):
File "/home/background/zopetest/lib/python/DocumentTemplate/tests/testDTML.py", line 295, in test_fmt
assert res == expected, res
AssertionError:
4200000
html=4200000
url=4200000
multi=4200000
dollars=$4200000
cents=$4200000.00
dollars,=$4,200,000
cents,=$4,200,000.00
None
html=None
url=None
multi=None
dollars=
cents=
dollars,=
cents,=
<a href="spam">
foo bar
html=<a href="spam">
foo bar
url=%3Ca%20href%3D%22spam%22%3E%0Afoo%20bar
multi=<a href="spam"><br />
foo bar
dollars=
cents=
dollars,=
cents,=
----------------------------------------------------------------------
Ran 1404 tests in 295.027s
FAILED (failures=3)
======================================================================
OVERALL FAILED (total failures=3)