[Zope-Coders] Win32 Test Results failures:1

zope-tests@squishdot.org zope-tests@squishdot.org
Tue, 28 May 2002 02:17:28 +0100


==============================================================================
==============================================================================
Python Version:2.1.3 (#35, Apr  8 2002, 17:47:50) [MSC 32 bit (Intel)]

Modules included:
Zope (HEAD)
CMF/CMFCore (HEAD)
CMF/CMFCalendar (HEAD)
CMF/CMFCollector (HEAD)
CMF/CMFDecor (HEAD)
CMF/CMFDefault (HEAD)
CMF/CMFTopic (HEAD)
CMF/CMFTracker (HEAD)
CMF/CMFWiki (HEAD)
CMF/DCWorkflow (HEAD)

----------------------------------------------------------------------
Ran 1709 tests in 267.875s

OK
==============================================================================
==============================================================================
Python Version:2.1.3 (#35, Apr  8 2002, 17:47:50) [MSC 32 bit (Intel)]

Modules included:
Zope (Zope-2_5-branch)

======================================================================
FAIL: checkTransactionalUndoAfterPack (testFileStorage.FileStorageTests)
----------------------------------------------------------------------
Traceback (most recent call last):
  File "E:\ZopeTests\sandbox\Zope\lib\python\ZODB\tests\TransactionalUndoStorage.py", line 448, in checkTransactionalUndoAfterPack
    eq(len(info2), 2)
  File "C:\Python21\lib\unittest.py", line 273, in failUnlessEqual
    raise self.failureException, (msg or '%s != %s' % (first, second))
AssertionError: 3 != 2
----------------------------------------------------------------------
Ran 1159 tests in 202.241s

FAILED (failures=1)

======================================================================
OVERALL FAILED (total failures=1)