[Zope-Coders] Zope test results
background@shane.zope.com
background@shane.zope.com
Tue, 28 May 2002 22:24:08 -0400 (EDT)
Zope2 tests include the ZEO and bsddb3Storage packages.
**********************************************************************
Zope CVS Head with Python 2.1.3
**********************************************************************
FullTest.checkVersionIterator() temporarily disabled.
----------------------------------------------------------------------
Ran 1403 tests in 295.123s
OK
**********************************************************************
Zope 2.5 branch with Python 2.1.3
**********************************************************************
FullTest.checkVersionIterator() temporarily disabled.
======================================================================
FAIL: checkDetail (testCache.LRUCacheTests)
----------------------------------------------------------------------
Traceback (most recent call last):
File "testCache.py", line 201, in checkDetail
File "/usr/lib/python2.1/unittest.py", line 273, in failUnlessEqual
raise self.failureException, (msg or '%s != %s' % (first, second))
AssertionError: 4 != 3
----------------------------------------------------------------------
Ran 1403 tests in 294.783s
FAILED (failures=1)
======================================================================
OVERALL FAILED (total failures=1)
**********************************************************************
Zope CVS Head with Python 2.2.1
**********************************************************************
FullTest.checkVersionIterator() temporarily disabled.
----------------------------------------------------------------------
Ran 1405 tests in 284.727s
OK