[Zope-Coders] FAILED (failures=5, errors=39): Test Zope 2 HEAD / Python 2.3 / Linux

jeremy at zope.com jeremy at zope.com
Tue Dec 2 06:10:02 EST 2003


Email automatically generated by a daily test runner.

cd /tmp/autotest7U7dCD/Zope
PYTHONPATH=/tmp/autotest7U7dCD/lib/python  /usr/local/bin/python2.3 -u test.py
Running unit tests from /tmp/autotest7U7dCD/Zope
Error importing OFS.tests.testTraverse
No module named testTraverse
Error importing Products.ExternalMethod.tests.testExternalMethod
No module named testExternalMethod
Error importing Products.MailHost.tests.testMailHost
No module named testMailHost
Error importing Products.PageTemplates.tests.testDTMLTests
No module named testDTMLTests
Error importing Products.PageTemplates.tests.testExpressions
No module named testExpressions
Error importing Products.PageTemplates.tests.testHTMLTests
No module named testHTMLTests
Error importing Products.PageTemplates.tests.testTALES
No module named testTALES
Error importing Products.PageTemplates.tests.test_ptfile
No module named test_ptfile
Error importing Products.PluginIndexes.DateIndex.tests.test_DateIndex
No module named test_DateIndex
Error importing Products.PluginIndexes.DateRangeIndex.tests.test_DateRangeIndex
No module named test_DateRangeIndex
Error importing Products.PluginIndexes.FieldIndex.tests.testFieldIndex
No module named testFieldIndex
Error importing Products.PluginIndexes.KeywordIndex.tests.testKeywordIndex
No module named testKeywordIndex
Error importing Products.PluginIndexes.PathIndex.tests.testPathIndex
No module named testPathIndex
Error importing Products.PluginIndexes.TextIndex.Splitter.UnicodeSplitter.tests.testUnicodeSplitter
No module named testUnicodeSplitter
Error importing Products.PluginIndexes.TextIndex.tests.testSplitter
No module named testSplitter
Error importing Products.PluginIndexes.TextIndex.tests.testTextIndex
No module named testTextIndex
Error importing Products.PluginIndexes.TopicIndex.tests.testTopicIndex
No module named testTopicIndex
Error importing Products.PythonScripts.tests.testPythonScript
No module named testPythonScript
Error importing Products.Sessions.tests.testBrowserIdManager
No module named testBrowserIdManager
Error importing Products.Transience.tests.testTimeoutRelated
No module named testTimeoutRelated
Error importing Products.Transience.tests.testTransientObject
No module named testTransientObject
Error importing Products.Transience.tests.testTransientObjectContainer
No module named testTransientObjectContainer
Error importing Products.ZCTextIndex.tests.testIndex
No module named testIndex
Error importing Products.ZCTextIndex.tests.testLexicon
No module named testLexicon
Error importing Products.ZCTextIndex.tests.testNBest
No module named testNBest
Error importing Products.ZCTextIndex.tests.testPipelineFactory
No module named testPipelineFactory
Error importing Products.ZCTextIndex.tests.testQueryEngine
No module named testQueryEngine
Error importing Products.ZCTextIndex.tests.testQueryParser
No module named testQueryParser
Error importing Products.ZCTextIndex.tests.testSetOps
No module named testSetOps
Error importing Products.ZCTextIndex.tests.testStopper
No module named testStopper
Error importing Products.ZCTextIndex.tests.testZCTextIndex
No module named testZCTextIndex
Error importing Products.ZCatalog.tests.testCatalog
No module named testCatalog
Error importing Products.ZODBMountPoint.tests.testMountPoint
No module named testMountPoint
Error importing RestrictedPython.tests.testRestrictions
No module named testRestrictions
Error importing StructuredText.tests.testStructuredText
No module named testStructuredText
Error importing TAL.tests.test_files
No module named test_files
Error importing TAL.tests.test_htmlparser
No module named test_htmlparser
Error importing TAL.tests.test_htmltalparser
No module named test_htmltalparser
Error importing TAL.tests.test_sourcepos
No module named test_sourcepos
Error importing TAL.tests.test_talinterpreter
No module named test_talinterpreter
Error importing TAL.tests.test_xmlparser
No module named test_xmlparser
Error importing ZConfig.tests.test_cfgimports
No module named test_cfgimports
Error importing ZConfig.tests.test_cmdline
No module named test_cmdline
Error importing ZConfig.tests.test_config
No module named test_config
Error importing ZConfig.tests.test_datatypes
No module named test_datatypes
Error importing ZConfig.tests.test_loader
No module named test_loader
Error importing ZConfig.tests.test_schema
No module named test_schema
Error importing ZConfig.tests.test_subst
No module named test_subst
Error importing ZEO.tests.testAuth
No module named testAuth
Error importing ZEO.tests.testClientCache
No module named testClientCache
Error importing ZEO.tests.testConnection
No module named testConnection
Error importing ZEO.tests.testMonitor
No module named ConnectionTests
Error importing ZEO.tests.testTransactionBuffer
No module named testTransactionBuffer
Error importing ZEO.tests.testZEO
cannot import name Synchronization
Error importing ZEO.tests.testZEOOptions
No module named testZEOOptions
Error importing ZODB.tests.testActivityMonitor
No module named testActivityMonitor
Error importing ZODB.tests.testConfig
No module named testConfig
Error importing ZODB.tests.testDB
No module named testDB
Error importing ZODB.tests.testDemoStorage
No module named testDemoStorage
Error importing ZODB.tests.testFileStorage
No module named testFileStorage
Error importing ZODB.tests.testMappingStorage
No module named testMappingStorage
Error importing ZODB.tests.testUtils
No module named testUtils
Error importing ZODB.tests.testfsIndex
No module named testfsIndex
Error importing ZPublisher.tests.testBaseRequest
No module named testBaseRequest
Error importing ZPublisher.tests.testHTTPRangeSupport
No module named testHTTPRangeSupport
Error importing ZPublisher.tests.testHTTPRequest
No module named testHTTPRequest
Error importing ZPublisher.tests.testHTTPResponse
No module named testHTTPResponse
Error importing ZPublisher.tests.testTaintedString
No module named testTaintedString
Error importing ZServer.tests.test_config
No module named test_config
Error importing ZTUtils.tests.testBatch
No module named testBatch
Error importing ZTUtils.tests.testIterator
No module named testIterator
Error importing ZTUtils.tests.testTree
No module named testTree
Error importing Zope.Startup.tests.test_schema
No module named test_schema
Error importing Zope.Startup.tests.test_warnfilter
cannot import name datatypes
Error importing ZopeUndo.tests.testPrefix
No module named testPrefix
Error importing tempstorage.tests.testTemporaryStorage
No module named testTemporaryStorage
Error importing zExceptions.tests.testExceptionFormatter
No module named testExceptionFormatter
Error importing zLOG.tests.testzLog
No module named testzLog
Error importing zLOG.tests.testzLogConfig
No module named testzLogConfig
Error importing zdaemon.tests.testzdoptions
No module named testzdoptions
Error importing zdaemon.tests.testzdrun
No module named testzdrun
Failure in test testMixedModule (AccessControl.tests.testModuleSecurity.SecurityTests)
Traceback (most recent call last):
  File "/tmp/autotest7U7dCD/Zope/lib/python/AccessControl/tests/testModuleSecurity.py", line 60, in testMixedModule
    self.assertAuth('AccessControl.tests.mixed_module', ())
  File "/tmp/autotest7U7dCD/Zope/lib/python/AccessControl/tests/testModuleSecurity.py", line 49, in assertAuth
    assert 0, ('Did not expose module instance %s, %s' %
AssertionError: Did not expose module instance 'AccessControl.tests.mixed_module', ()

Failure in test testPublicModule (AccessControl.tests.testModuleSecurity.SecurityTests)
Traceback (most recent call last):
  File "/tmp/autotest7U7dCD/Zope/lib/python/AccessControl/tests/testModuleSecurity.py", line 70, in testPublicModule
    fromlist)
  File "/tmp/autotest7U7dCD/Zope/lib/python/AccessControl/tests/testModuleSecurity.py", line 49, in assertAuth
    assert 0, ('Did not expose module instance %s, %s' %
AssertionError: Did not expose module instance 'AccessControl.tests.public_module', ()

Error in test testBasicHTMLIn (AccessControl.tests.testSecurity.SecurityTests)
Traceback (most recent call last):
  File "/tmp/autotest7U7dCD/Zope/lib/python/DocumentTemplate/tests/testDTML.py", line 460, in testBasicHTMLIn
    result = self.doc_class(html)(data=data)
  File "/tmp/autotest7U7dCD/Zope/lib/python/Products/PythonScripts/standard.py", line 53, in __call__
    return HTML.__call__(self, client, REQUEST, **kw)
  File "/tmp/autotest7U7dCD/Zope/lib/python/DocumentTemplate/DT_String.py", line 412, in __call__
    self.cook()
  File "/tmp/autotest7U7dCD/Zope/lib/python/DocumentTemplate/DT_String.py", line 340, in cook
    self._v_blocks=self.parse(self.read())
  File "/tmp/autotest7U7dCD/Zope/lib/python/DocumentTemplate/DT_String.py", line 161, in parse
    try: tag, args, command, coname = self._parseTag(mo)
  File "/tmp/autotest7U7dCD/Zope/lib/python/DocumentTemplate/DT_String.py", line 103, in _parseTag
    exec 'from DocumentTemplate.%s import %s' % (module, name) in d
  File "<string>", line 1, in ?
ImportError: No module named DT_In

Error in test testBasicHTMLIn2 (AccessControl.tests.testSecurity.SecurityTests)
Traceback (most recent call last):
  File "/tmp/autotest7U7dCD/Zope/lib/python/DocumentTemplate/tests/testDTML.py", line 475, in testBasicHTMLIn2
    result = self.doc_class(html)(xxx=xxx)
  File "/tmp/autotest7U7dCD/Zope/lib/python/Products/PythonScripts/standard.py", line 53, in __call__
    return HTML.__call__(self, client, REQUEST, **kw)
  File "/tmp/autotest7U7dCD/Zope/lib/python/DocumentTemplate/DT_String.py", line 412, in __call__
    self.cook()
  File "/tmp/autotest7U7dCD/Zope/lib/python/DocumentTemplate/DT_String.py", line 340, in cook
    self._v_blocks=self.parse(self.read())
  File "/tmp/autotest7U7dCD/Zope/lib/python/DocumentTemplate/DT_String.py", line 161, in parse
    try: tag, args, command, coname = self._parseTag(mo)
  File "/tmp/autotest7U7dCD/Zope/lib/python/DocumentTemplate/DT_String.py", line 103, in _parseTag
    exec 'from DocumentTemplate.%s import %s' % (module, name) in d
  File "<string>", line 1, in ?
ImportError: No module named DT_In

Error in test testBasicHTMLIn3 (AccessControl.tests.testSecurity.SecurityTests)
Traceback (most recent call last):
  File "/tmp/autotest7U7dCD/Zope/lib/python/DocumentTemplate/tests/testDTML.py", line 482, in testBasicHTMLIn3
    result = self.doc_class(html)(None, ns)
  File "/tmp/autotest7U7dCD/Zope/lib/python/Products/PythonScripts/standard.py", line 53, in __call__
    return HTML.__call__(self, client, REQUEST, **kw)
  File "/tmp/autotest7U7dCD/Zope/lib/python/DocumentTemplate/DT_String.py", line 412, in __call__
    self.cook()
  File "/tmp/autotest7U7dCD/Zope/lib/python/DocumentTemplate/DT_String.py", line 340, in cook
    self._v_blocks=self.parse(self.read())
  File "/tmp/autotest7U7dCD/Zope/lib/python/DocumentTemplate/DT_String.py", line 161, in parse
    try: tag, args, command, coname = self._parseTag(mo)
  File "/tmp/autotest7U7dCD/Zope/lib/python/DocumentTemplate/DT_String.py", line 103, in _parseTag
    exec 'from DocumentTemplate.%s import %s' % (module, name) in d
  File "<string>", line 1, in ?
ImportError: No module named DT_In

Error in test testBasicStringIn (AccessControl.tests.testSecurity.SecurityTests)
Traceback (most recent call last):
  File "/tmp/autotest7U7dCD/Zope/lib/python/DocumentTemplate/tests/testDTML.py", line 526, in testBasicStringIn
    result = String(s)(data=data)
  File "/tmp/autotest7U7dCD/Zope/lib/python/DocumentTemplate/DT_String.py", line 412, in __call__
    self.cook()
  File "/tmp/autotest7U7dCD/Zope/lib/python/DocumentTemplate/DT_String.py", line 340, in cook
    self._v_blocks=self.parse(self.read())
  File "/tmp/autotest7U7dCD/Zope/lib/python/DocumentTemplate/DT_String.py", line 161, in parse
    try: tag, args, command, coname = self._parseTag(mo)
  File "/tmp/autotest7U7dCD/Zope/lib/python/DocumentTemplate/DT_String.py", line 103, in _parseTag
    exec 'from DocumentTemplate.%s import %s' % (module, name) in d
  File "<string>", line 1, in ?
ImportError: No module named DT_In

Error in test testBatchingEtc (AccessControl.tests.testSecurity.SecurityTests)
Traceback (most recent call last):
  File "/tmp/autotest7U7dCD/Zope/lib/python/DocumentTemplate/tests/testDTML.py", line 165, in testBatchingEtc
    html=self.doc_class(read_file('dealers.dtml'))
  File "/tmp/autotest7U7dCD/Zope/lib/python/DocumentTemplate/tests/testDTML.py", line 29, in read_file
    f = open(os.path.join(here, name), 'r')
IOError: [Errno 2] No such file or directory: '/tmp/autotest7U7dCD/Zope/lib/python/DocumentTemplate/tests/dealers.dtml'

Error in test testHTMLInElse (AccessControl.tests.testSecurity.SecurityTests)
Traceback (most recent call last):
  File "/tmp/autotest7U7dCD/Zope/lib/python/DocumentTemplate/tests/testDTML.py", line 503, in testHTMLInElse
    result = self.doc_class(html)(xxx=xxx, data={})
  File "/tmp/autotest7U7dCD/Zope/lib/python/Products/PythonScripts/standard.py", line 53, in __call__
    return HTML.__call__(self, client, REQUEST, **kw)
  File "/tmp/autotest7U7dCD/Zope/lib/python/DocumentTemplate/DT_String.py", line 412, in __call__
    self.cook()
  File "/tmp/autotest7U7dCD/Zope/lib/python/DocumentTemplate/DT_String.py", line 340, in cook
    self._v_blocks=self.parse(self.read())
  File "/tmp/autotest7U7dCD/Zope/lib/python/DocumentTemplate/DT_String.py", line 161, in parse
    try: tag, args, command, coname = self._parseTag(mo)
  File "/tmp/autotest7U7dCD/Zope/lib/python/DocumentTemplate/DT_String.py", line 103, in _parseTag
    exec 'from DocumentTemplate.%s import %s' % (module, name) in d
  File "<string>", line 1, in ?
ImportError: No module named DT_In

Error in test testNoImplicitAccess (AccessControl.tests.testSecurity.SecurityTests)
Traceback (most recent call last):
  File "/tmp/autotest7U7dCD/Zope/lib/python/AccessControl/tests/testSecurity.py", line 44, in testNoImplicitAccess
    doc(person=person())
  File "/tmp/autotest7U7dCD/Zope/lib/python/Products/PythonScripts/standard.py", line 53, in __call__
    return HTML.__call__(self, client, REQUEST, **kw)
  File "/tmp/autotest7U7dCD/Zope/lib/python/DocumentTemplate/DT_String.py", line 412, in __call__
    self.cook()
  File "/tmp/autotest7U7dCD/Zope/lib/python/DocumentTemplate/DT_String.py", line 340, in cook
    self._v_blocks=self.parse(self.read())
  File "/tmp/autotest7U7dCD/Zope/lib/python/DocumentTemplate/DT_String.py", line 161, in parse
    try: tag, args, command, coname = self._parseTag(mo)
  File "/tmp/autotest7U7dCD/Zope/lib/python/DocumentTemplate/DT_String.py", line 103, in _parseTag
    exec 'from DocumentTemplate.%s import %s' % (module, name) in d
  File "<string>", line 1, in ?
ImportError: No module named DT_With

Error in test testNoItemPush (AccessControl.tests.testSecurity.SecurityTests)
Traceback (most recent call last):
  File "/tmp/autotest7U7dCD/Zope/lib/python/DocumentTemplate/tests/testDTML.py", line 436, in testNoItemPush
    result = self.doc_class(html)(data=data)
  File "/tmp/autotest7U7dCD/Zope/lib/python/Products/PythonScripts/standard.py", line 53, in __call__
    return HTML.__call__(self, client, REQUEST, **kw)
  File "/tmp/autotest7U7dCD/Zope/lib/python/DocumentTemplate/DT_String.py", line 412, in __call__
    self.cook()
  File "/tmp/autotest7U7dCD/Zope/lib/python/DocumentTemplate/DT_String.py", line 340, in cook
    self._v_blocks=self.parse(self.read())
  File "/tmp/autotest7U7dCD/Zope/lib/python/DocumentTemplate/DT_String.py", line 161, in parse
    try: tag, args, command, coname = self._parseTag(mo)
  File "/tmp/autotest7U7dCD/Zope/lib/python/DocumentTemplate/DT_String.py", line 103, in _parseTag
    exec 'from DocumentTemplate.%s import %s' % (module, name) in d
  File "<string>", line 1, in ?
ImportError: No module named DT_With

Error in test testPropogatedError (AccessControl.tests.testSecurity.SecurityTests)
Traceback (most recent call last):
  File "/tmp/autotest7U7dCD/Zope/lib/python/DocumentTemplate/tests/testDTML.py", line 371, in testPropogatedError
    html(spam=foo())
  File "/tmp/autotest7U7dCD/Zope/lib/python/Products/PythonScripts/standard.py", line 53, in __call__
    return HTML.__call__(self, client, REQUEST, **kw)
  File "/tmp/autotest7U7dCD/Zope/lib/python/DocumentTemplate/DT_String.py", line 412, in __call__
    self.cook()
  File "/tmp/autotest7U7dCD/Zope/lib/python/DocumentTemplate/DT_String.py", line 340, in cook
    self._v_blocks=self.parse(self.read())
  File "/tmp/autotest7U7dCD/Zope/lib/python/DocumentTemplate/DT_String.py", line 170, in parse
    tag, l, args, command)
  File "/tmp/autotest7U7dCD/Zope/lib/python/DocumentTemplate/DT_String.py", line 211, in parse_block
    try: tag, args, command, coname= self._parseTag(mo,scommand,sa)
  File "/tmp/autotest7U7dCD/Zope/lib/python/DocumentTemplate/DT_String.py", line 103, in _parseTag
    exec 'from DocumentTemplate.%s import %s' % (module, name) in d
  File "<string>", line 1, in ?
ImportError: No module named DT_In

Error in test testRaise (AccessControl.tests.testSecurity.SecurityTests)
Traceback (most recent call last):
  File "/tmp/autotest7U7dCD/Zope/lib/python/DocumentTemplate/tests/testDTML.py", line 420, in testRaise
    res = self.doc_class(
  File "/tmp/autotest7U7dCD/Zope/lib/python/Products/PythonScripts/standard.py", line 53, in __call__
    return HTML.__call__(self, client, REQUEST, **kw)
  File "/tmp/autotest7U7dCD/Zope/lib/python/DocumentTemplate/DT_String.py", line 412, in __call__
    self.cook()
  File "/tmp/autotest7U7dCD/Zope/lib/python/DocumentTemplate/DT_String.py", line 340, in cook
    self._v_blocks=self.parse(self.read())
  File "/tmp/autotest7U7dCD/Zope/lib/python/DocumentTemplate/DT_String.py", line 161, in parse
    try: tag, args, command, coname = self._parseTag(mo)
  File "/tmp/autotest7U7dCD/Zope/lib/python/DocumentTemplate/DT_String.py", line 103, in _parseTag
    exec 'from DocumentTemplate.%s import %s' % (module, name) in d
  File "<string>", line 1, in ?
ImportError: No module named DT_Raise

Error in test testSequence1 (AccessControl.tests.testSecurity.SecurityTests)
Traceback (most recent call last):
  File "/tmp/autotest7U7dCD/Zope/lib/python/DocumentTemplate/tests/testDTML.py", line 236, in testSequence1
    res = html(spam=[[1,2,3],[4,5,6]])
  File "/tmp/autotest7U7dCD/Zope/lib/python/Products/PythonScripts/standard.py", line 53, in __call__
    return HTML.__call__(self, client, REQUEST, **kw)
  File "/tmp/autotest7U7dCD/Zope/lib/python/DocumentTemplate/DT_String.py", line 412, in __call__
    self.cook()
  File "/tmp/autotest7U7dCD/Zope/lib/python/DocumentTemplate/DT_String.py", line 340, in cook
    self._v_blocks=self.parse(self.read())
  File "/tmp/autotest7U7dCD/Zope/lib/python/DocumentTemplate/DT_String.py", line 161, in parse
    try: tag, args, command, coname = self._parseTag(mo)
  File "/tmp/autotest7U7dCD/Zope/lib/python/DocumentTemplate/DT_String.py", line 103, in _parseTag
    exec 'from DocumentTemplate.%s import %s' % (module, name) in d
  File "<string>", line 1, in ?
ImportError: No module named DT_In

Error in test testSequence2 (AccessControl.tests.testSecurity.SecurityTests)
Traceback (most recent call last):
  File "/tmp/autotest7U7dCD/Zope/lib/python/DocumentTemplate/tests/testDTML.py", line 244, in testSequence2
    res = html(spam=[[1,2,3],[4,5,6]])
  File "/tmp/autotest7U7dCD/Zope/lib/python/Products/PythonScripts/standard.py", line 53, in __call__
    return HTML.__call__(self, client, REQUEST, **kw)
  File "/tmp/autotest7U7dCD/Zope/lib/python/DocumentTemplate/DT_String.py", line 412, in __call__
    self.cook()
  File "/tmp/autotest7U7dCD/Zope/lib/python/DocumentTemplate/DT_String.py", line 340, in cook
    self._v_blocks=self.parse(self.read())
  File "/tmp/autotest7U7dCD/Zope/lib/python/DocumentTemplate/DT_String.py", line 161, in parse
    try: tag, args, command, coname = self._parseTag(mo)
  File "/tmp/autotest7U7dCD/Zope/lib/python/DocumentTemplate/DT_String.py", line 103, in _parseTag
    exec 'from DocumentTemplate.%s import %s' % (module, name) in d
  File "<string>", line 1, in ?
ImportError: No module named DT_In

Error in test testSequenceSummaries (AccessControl.tests.testSecurity.SecurityTests)
Traceback (most recent call last):
  File "/tmp/autotest7U7dCD/Zope/lib/python/DocumentTemplate/tests/testDTML.py", line 198, in testSequenceSummaries
    res = html(data=data)
  File "/tmp/autotest7U7dCD/Zope/lib/python/Products/PythonScripts/standard.py", line 53, in __call__
    return HTML.__call__(self, client, REQUEST, **kw)
  File "/tmp/autotest7U7dCD/Zope/lib/python/DocumentTemplate/DT_String.py", line 412, in __call__
    self.cook()
  File "/tmp/autotest7U7dCD/Zope/lib/python/DocumentTemplate/DT_String.py", line 340, in cook
    self._v_blocks=self.parse(self.read())
  File "/tmp/autotest7U7dCD/Zope/lib/python/DocumentTemplate/DT_String.py", line 161, in parse
    try: tag, args, command, coname = self._parseTag(mo)
  File "/tmp/autotest7U7dCD/Zope/lib/python/DocumentTemplate/DT_String.py", line 103, in _parseTag
    exec 'from DocumentTemplate.%s import %s' % (module, name) in d
  File "<string>", line 1, in ?
ImportError: No module named DT_In

Error in test testWith (AccessControl.tests.testSecurity.SecurityTests)
Traceback (most recent call last):
  File "/tmp/autotest7U7dCD/Zope/lib/python/DocumentTemplate/tests/testDTML.py", line 412, in testWith
    res = self.doc_class(
  File "/tmp/autotest7U7dCD/Zope/lib/python/Products/PythonScripts/standard.py", line 53, in __call__
    return HTML.__call__(self, client, REQUEST, **kw)
  File "/tmp/autotest7U7dCD/Zope/lib/python/DocumentTemplate/DT_String.py", line 412, in __call__
    self.cook()
  File "/tmp/autotest7U7dCD/Zope/lib/python/DocumentTemplate/DT_String.py", line 340, in cook
    self._v_blocks=self.parse(self.read())
  File "/tmp/autotest7U7dCD/Zope/lib/python/DocumentTemplate/DT_String.py", line 161, in parse
    try: tag, args, command, coname = self._parseTag(mo)
  File "/tmp/autotest7U7dCD/Zope/lib/python/DocumentTemplate/DT_String.py", line 103, in _parseTag
    exec 'from DocumentTemplate.%s import %s' % (module, name) in d
  File "<string>", line 1, in ?
ImportError: No module named DT_With

Failure in test checkPackNowWhileWriting (BDBStorage.tests.test_storage_api.FullTest)
Traceback (most recent call last):
  File "/tmp/autotest7U7dCD/Zope/lib/python/ZODB/tests/PackableStorage.py", line 437, in checkPackNowWhileWriting
    self._PackWhileWriting(pack_now=1)
  File "/tmp/autotest7U7dCD/Zope/lib/python/ZODB/tests/PackableStorage.py", line 420, in _PackWhileWriting
    self.assert_(not t.isAlive())
  File "/usr/local/lib/python2.3/unittest.py", line 278, in failUnless
    if not expr: raise self.failureException, msg
AssertionError

Error in test testJulianWeek (DateTime.tests.testDateTime.DateTimeTests)
Traceback (most recent call last):
  File "/tmp/autotest7U7dCD/Zope/lib/python/DateTime/tests/testDateTime.py", line 282, in testJulianWeek
    lines = gzip.GzipFile(fn).readlines()
  File "/usr/local/lib/python2.3/gzip.py", line 94, in __init__
    fileobj = self.myfileobj = __builtin__.open(filename, mode or 'rb')
IOError: [Errno 2] No such file or directory: '/tmp/autotest7U7dCD/Zope/lib/python/DateTime/tests/julian_testdata.txt.gz'

Error in test testBasicHTMLIn (DocumentTemplate.tests.testDTML.DTMLTests)
Traceback (most recent call last):
  File "/tmp/autotest7U7dCD/Zope/lib/python/DocumentTemplate/tests/testDTML.py", line 460, in testBasicHTMLIn
    result = self.doc_class(html)(data=data)
  File "/tmp/autotest7U7dCD/Zope/lib/python/DocumentTemplate/DT_String.py", line 412, in __call__
    self.cook()
  File "/tmp/autotest7U7dCD/Zope/lib/python/DocumentTemplate/DT_String.py", line 340, in cook
    self._v_blocks=self.parse(self.read())
  File "/tmp/autotest7U7dCD/Zope/lib/python/DocumentTemplate/DT_String.py", line 161, in parse
    try: tag, args, command, coname = self._parseTag(mo)
  File "/tmp/autotest7U7dCD/Zope/lib/python/DocumentTemplate/DT_String.py", line 103, in _parseTag
    exec 'from DocumentTemplate.%s import %s' % (module, name) in d
  File "<string>", line 1, in ?
ImportError: No module named DT_In

Error in test testBasicHTMLIn2 (DocumentTemplate.tests.testDTML.DTMLTests)
Traceback (most recent call last):
  File "/tmp/autotest7U7dCD/Zope/lib/python/DocumentTemplate/tests/testDTML.py", line 475, in testBasicHTMLIn2
    result = self.doc_class(html)(xxx=xxx)
  File "/tmp/autotest7U7dCD/Zope/lib/python/DocumentTemplate/DT_String.py", line 412, in __call__
    self.cook()
  File "/tmp/autotest7U7dCD/Zope/lib/python/DocumentTemplate/DT_String.py", line 340, in cook
    self._v_blocks=self.parse(self.read())
  File "/tmp/autotest7U7dCD/Zope/lib/python/DocumentTemplate/DT_String.py", line 161, in parse
    try: tag, args, command, coname = self._parseTag(mo)
  File "/tmp/autotest7U7dCD/Zope/lib/python/DocumentTemplate/DT_String.py", line 103, in _parseTag
    exec 'from DocumentTemplate.%s import %s' % (module, name) in d
  File "<string>", line 1, in ?
ImportError: No module named DT_In

Error in test testBasicHTMLIn3 (DocumentTemplate.tests.testDTML.DTMLTests)
Traceback (most recent call last):
  File "/tmp/autotest7U7dCD/Zope/lib/python/DocumentTemplate/tests/testDTML.py", line 482, in testBasicHTMLIn3
    result = self.doc_class(html)(None, ns)
  File "/tmp/autotest7U7dCD/Zope/lib/python/DocumentTemplate/DT_String.py", line 412, in __call__
    self.cook()
  File "/tmp/autotest7U7dCD/Zope/lib/python/DocumentTemplate/DT_String.py", line 340, in cook
    self._v_blocks=self.parse(self.read())
  File "/tmp/autotest7U7dCD/Zope/lib/python/DocumentTemplate/DT_String.py", line 161, in parse
    try: tag, args, command, coname = self._parseTag(mo)
  File "/tmp/autotest7U7dCD/Zope/lib/python/DocumentTemplate/DT_String.py", line 103, in _parseTag
    exec 'from DocumentTemplate.%s import %s' % (module, name) in d
  File "<string>", line 1, in ?
ImportError: No module named DT_In

Error in test testBasicStringIn (DocumentTemplate.tests.testDTML.DTMLTests)
Traceback (most recent call last):
  File "/tmp/autotest7U7dCD/Zope/lib/python/DocumentTemplate/tests/testDTML.py", line 526, in testBasicStringIn
    result = String(s)(data=data)
  File "/tmp/autotest7U7dCD/Zope/lib/python/DocumentTemplate/DT_String.py", line 412, in __call__
    self.cook()
  File "/tmp/autotest7U7dCD/Zope/lib/python/DocumentTemplate/DT_String.py", line 340, in cook
    self._v_blocks=self.parse(self.read())
  File "/tmp/autotest7U7dCD/Zope/lib/python/DocumentTemplate/DT_String.py", line 161, in parse
    try: tag, args, command, coname = self._parseTag(mo)
  File "/tmp/autotest7U7dCD/Zope/lib/python/DocumentTemplate/DT_String.py", line 103, in _parseTag
    exec 'from DocumentTemplate.%s import %s' % (module, name) in d
  File "<string>", line 1, in ?
ImportError: No module named DT_In

Error in test testBatchingEtc (DocumentTemplate.tests.testDTML.DTMLTests)
Traceback (most recent call last):
  File "/tmp/autotest7U7dCD/Zope/lib/python/DocumentTemplate/tests/testDTML.py", line 165, in testBatchingEtc
    html=self.doc_class(read_file('dealers.dtml'))
  File "/tmp/autotest7U7dCD/Zope/lib/python/DocumentTemplate/tests/testDTML.py", line 29, in read_file
    f = open(os.path.join(here, name), 'r')
IOError: [Errno 2] No such file or directory: '/tmp/autotest7U7dCD/Zope/lib/python/DocumentTemplate/tests/dealers.dtml'

Error in test testHTMLInElse (DocumentTemplate.tests.testDTML.DTMLTests)
Traceback (most recent call last):
  File "/tmp/autotest7U7dCD/Zope/lib/python/DocumentTemplate/tests/testDTML.py", line 503, in testHTMLInElse
    result = self.doc_class(html)(xxx=xxx, data={})
  File "/tmp/autotest7U7dCD/Zope/lib/python/DocumentTemplate/DT_String.py", line 412, in __call__
    self.cook()
  File "/tmp/autotest7U7dCD/Zope/lib/python/DocumentTemplate/DT_String.py", line 340, in cook
    self._v_blocks=self.parse(self.read())
  File "/tmp/autotest7U7dCD/Zope/lib/python/DocumentTemplate/DT_String.py", line 161, in parse
    try: tag, args, command, coname = self._parseTag(mo)
  File "/tmp/autotest7U7dCD/Zope/lib/python/DocumentTemplate/DT_String.py", line 103, in _parseTag
    exec 'from DocumentTemplate.%s import %s' % (module, name) in d
  File "<string>", line 1, in ?
ImportError: No module named DT_In

Error in test testNoItemPush (DocumentTemplate.tests.testDTML.DTMLTests)
Traceback (most recent call last):
  File "/tmp/autotest7U7dCD/Zope/lib/python/DocumentTemplate/tests/testDTML.py", line 436, in testNoItemPush
    result = self.doc_class(html)(data=data)
  File "/tmp/autotest7U7dCD/Zope/lib/python/DocumentTemplate/DT_String.py", line 412, in __call__
    self.cook()
  File "/tmp/autotest7U7dCD/Zope/lib/python/DocumentTemplate/DT_String.py", line 340, in cook
    self._v_blocks=self.parse(self.read())
  File "/tmp/autotest7U7dCD/Zope/lib/python/DocumentTemplate/DT_String.py", line 161, in parse
    try: tag, args, command, coname = self._parseTag(mo)
  File "/tmp/autotest7U7dCD/Zope/lib/python/DocumentTemplate/DT_String.py", line 103, in _parseTag
    exec 'from DocumentTemplate.%s import %s' % (module, name) in d
  File "<string>", line 1, in ?
ImportError: No module named DT_With

Error in test testPropogatedError (DocumentTemplate.tests.testDTML.DTMLTests)
Traceback (most recent call last):
  File "/tmp/autotest7U7dCD/Zope/lib/python/DocumentTemplate/tests/testDTML.py", line 371, in testPropogatedError
    html(spam=foo())
  File "/tmp/autotest7U7dCD/Zope/lib/python/DocumentTemplate/DT_String.py", line 412, in __call__
    self.cook()
  File "/tmp/autotest7U7dCD/Zope/lib/python/DocumentTemplate/DT_String.py", line 340, in cook
    self._v_blocks=self.parse(self.read())
  File "/tmp/autotest7U7dCD/Zope/lib/python/DocumentTemplate/DT_String.py", line 170, in parse
    tag, l, args, command)
  File "/tmp/autotest7U7dCD/Zope/lib/python/DocumentTemplate/DT_String.py", line 211, in parse_block
    try: tag, args, command, coname= self._parseTag(mo,scommand,sa)
  File "/tmp/autotest7U7dCD/Zope/lib/python/DocumentTemplate/DT_String.py", line 103, in _parseTag
    exec 'from DocumentTemplate.%s import %s' % (module, name) in d
  File "<string>", line 1, in ?
ImportError: No module named DT_In

Error in test testRaise (DocumentTemplate.tests.testDTML.DTMLTests)
Traceback (most recent call last):
  File "/tmp/autotest7U7dCD/Zope/lib/python/DocumentTemplate/tests/testDTML.py", line 420, in testRaise
    res = self.doc_class(
  File "/tmp/autotest7U7dCD/Zope/lib/python/DocumentTemplate/DT_String.py", line 412, in __call__
    self.cook()
  File "/tmp/autotest7U7dCD/Zope/lib/python/DocumentTemplate/DT_String.py", line 340, in cook
    self._v_blocks=self.parse(self.read())
  File "/tmp/autotest7U7dCD/Zope/lib/python/DocumentTemplate/DT_String.py", line 161, in parse
    try: tag, args, command, coname = self._parseTag(mo)
  File "/tmp/autotest7U7dCD/Zope/lib/python/DocumentTemplate/DT_String.py", line 103, in _parseTag
    exec 'from DocumentTemplate.%s import %s' % (module, name) in d
  File "<string>", line 1, in ?
ImportError: No module named DT_Raise

Error in test testSequence1 (DocumentTemplate.tests.testDTML.DTMLTests)
Traceback (most recent call last):
  File "/tmp/autotest7U7dCD/Zope/lib/python/DocumentTemplate/tests/testDTML.py", line 236, in testSequence1
    res = html(spam=[[1,2,3],[4,5,6]])
  File "/tmp/autotest7U7dCD/Zope/lib/python/DocumentTemplate/DT_String.py", line 412, in __call__
    self.cook()
  File "/tmp/autotest7U7dCD/Zope/lib/python/DocumentTemplate/DT_String.py", line 340, in cook
    self._v_blocks=self.parse(self.read())
  File "/tmp/autotest7U7dCD/Zope/lib/python/DocumentTemplate/DT_String.py", line 161, in parse
    try: tag, args, command, coname = self._parseTag(mo)
  File "/tmp/autotest7U7dCD/Zope/lib/python/DocumentTemplate/DT_String.py", line 103, in _parseTag
    exec 'from DocumentTemplate.%s import %s' % (module, name) in d
  File "<string>", line 1, in ?
ImportError: No module named DT_In

Error in test testSequence2 (DocumentTemplate.tests.testDTML.DTMLTests)
Traceback (most recent call last):
  File "/tmp/autotest7U7dCD/Zope/lib/python/DocumentTemplate/tests/testDTML.py", line 244, in testSequence2
    res = html(spam=[[1,2,3],[4,5,6]])
  File "/tmp/autotest7U7dCD/Zope/lib/python/DocumentTemplate/DT_String.py", line 412, in __call__
    self.cook()
  File "/tmp/autotest7U7dCD/Zope/lib/python/DocumentTemplate/DT_String.py", line 340, in cook
    self._v_blocks=self.parse(self.read())
  File "/tmp/autotest7U7dCD/Zope/lib/python/DocumentTemplate/DT_String.py", line 161, in parse
    try: tag, args, command, coname = self._parseTag(mo)
  File "/tmp/autotest7U7dCD/Zope/lib/python/DocumentTemplate/DT_String.py", line 103, in _parseTag
    exec 'from DocumentTemplate.%s import %s' % (module, name) in d
  File "<string>", line 1, in ?
ImportError: No module named DT_In

Error in test testSequenceSummaries (DocumentTemplate.tests.testDTML.DTMLTests)
Traceback (most recent call last):
  File "/tmp/autotest7U7dCD/Zope/lib/python/DocumentTemplate/tests/testDTML.py", line 198, in testSequenceSummaries
    res = html(data=data)
  File "/tmp/autotest7U7dCD/Zope/lib/python/DocumentTemplate/DT_String.py", line 412, in __call__
    self.cook()
  File "/tmp/autotest7U7dCD/Zope/lib/python/DocumentTemplate/DT_String.py", line 340, in cook
    self._v_blocks=self.parse(self.read())
  File "/tmp/autotest7U7dCD/Zope/lib/python/DocumentTemplate/DT_String.py", line 161, in parse
    try: tag, args, command, coname = self._parseTag(mo)
  File "/tmp/autotest7U7dCD/Zope/lib/python/DocumentTemplate/DT_String.py", line 103, in _parseTag
    exec 'from DocumentTemplate.%s import %s' % (module, name) in d
  File "<string>", line 1, in ?
ImportError: No module named DT_In

Error in test testWith (DocumentTemplate.tests.testDTML.DTMLTests)
Traceback (most recent call last):
  File "/tmp/autotest7U7dCD/Zope/lib/python/DocumentTemplate/tests/testDTML.py", line 412, in testWith
    res = self.doc_class(
  File "/tmp/autotest7U7dCD/Zope/lib/python/DocumentTemplate/DT_String.py", line 412, in __call__
    self.cook()
  File "/tmp/autotest7U7dCD/Zope/lib/python/DocumentTemplate/DT_String.py", line 340, in cook
    self._v_blocks=self.parse(self.read())
  File "/tmp/autotest7U7dCD/Zope/lib/python/DocumentTemplate/DT_String.py", line 161, in parse
    try: tag, args, command, coname = self._parseTag(mo)
  File "/tmp/autotest7U7dCD/Zope/lib/python/DocumentTemplate/DT_String.py", line 103, in _parseTag
    exec 'from DocumentTemplate.%s import %s' % (module, name) in d
  File "<string>", line 1, in ?
ImportError: No module named DT_With

Error in test testBlech (Interface.tests.testDocument.Test)
Traceback (most recent call last):
  File "/tmp/autotest7U7dCD/Zope/lib/python/Interface/tests/testDocument.py", line 27, in testBlech
    from Interface.Document import asStructuredText
ImportError: No module named Document

Error in test testModule (Interface.tests.testVerify.Test)
Traceback (most recent call last):
  File "/tmp/autotest7U7dCD/Zope/lib/python/Interface/tests/testVerify.py", line 168, in testModule
    from Interface.tests.IFoo import IFoo
ImportError: No module named IFoo

Failure in test test_add_one_file (OFS.tests.testContentTypes.ContentTypesTestCase)
Traceback (most recent call last):
  File "/tmp/autotest7U7dCD/Zope/lib/python/OFS/tests/testContentTypes.py", line 53, in test_add_one_file
    self.assertEqual(ctype, "text/x-vnd.zope.test-mime-type-1")
  File "/usr/local/lib/python2.3/unittest.py", line 302, in failUnlessEqual
    raise self.failureException, \
AssertionError: 'text/x-unknown-content-type' != 'text/x-vnd.zope.test-mime-type-1'

Failure in test test_add_two_files (OFS.tests.testContentTypes.ContentTypesTestCase)
Traceback (most recent call last):
  File "/tmp/autotest7U7dCD/Zope/lib/python/OFS/tests/testContentTypes.py", line 64, in test_add_two_files
    self.assertEqual(ctype, "text/x-vnd.zope.test-mime-type-1")
  File "/usr/local/lib/python2.3/unittest.py", line 302, in failUnlessEqual
    raise self.failureException, \
AssertionError: 'text/x-unknown-content-type' != 'text/x-vnd.zope.test-mime-type-1'

Error in test testDropPrivileges (Zope.Startup.tests.testStarter.ZopeStarterTestCase)
Traceback (most recent call last):
  File "/tmp/autotest7U7dCD/Zope/lib/python/Zope/Startup/tests/testStarter.py", line 54, in setUp
    ZopeStarterTestCase.schema = getSchema()
  File "/tmp/autotest7U7dCD/Zope/lib/python/Zope/Startup/tests/testStarter.py", line 35, in getSchema
    return ZConfig.loadSchema(schemafile)
  File "/tmp/autotest7U7dCD/Zope/lib/python/ZConfig/loader.py", line 37, in loadSchema
    return SchemaLoader().loadURL(url)
  File "/tmp/autotest7U7dCD/Zope/lib/python/ZConfig/loader.py", line 69, in loadURL
    r = self.openResource(url)
  File "/tmp/autotest7U7dCD/Zope/lib/python/ZConfig/loader.py", line 104, in openResource
    raise error
ConfigurationError: error opening resource file:///tmp/autotest7U7dCD/Zope/lib/python/Zope/Startup/zopeschema.xml: [Errno 2] No such file or directory: '/tmp/autotest7U7dCD/Zope/lib/python/Zope/Startup/zopeschema.xml'

Error in test testMakeLockFile (Zope.Startup.tests.testStarter.ZopeStarterTestCase)
Traceback (most recent call last):
  File "/tmp/autotest7U7dCD/Zope/lib/python/Zope/Startup/tests/testStarter.py", line 54, in setUp
    ZopeStarterTestCase.schema = getSchema()
  File "/tmp/autotest7U7dCD/Zope/lib/python/Zope/Startup/tests/testStarter.py", line 35, in getSchema
    return ZConfig.loadSchema(schemafile)
  File "/tmp/autotest7U7dCD/Zope/lib/python/ZConfig/loader.py", line 37, in loadSchema
    return SchemaLoader().loadURL(url)
  File "/tmp/autotest7U7dCD/Zope/lib/python/ZConfig/loader.py", line 69, in loadURL
    r = self.openResource(url)
  File "/tmp/autotest7U7dCD/Zope/lib/python/ZConfig/loader.py", line 104, in openResource
    raise error
ConfigurationError: error opening resource file:///tmp/autotest7U7dCD/Zope/lib/python/Zope/Startup/zopeschema.xml: [Errno 2] No such file or directory: '/tmp/autotest7U7dCD/Zope/lib/python/Zope/Startup/zopeschema.xml'

Error in test testMakePidFile (Zope.Startup.tests.testStarter.ZopeStarterTestCase)
Traceback (most recent call last):
  File "/tmp/autotest7U7dCD/Zope/lib/python/Zope/Startup/tests/testStarter.py", line 54, in setUp
    ZopeStarterTestCase.schema = getSchema()
  File "/tmp/autotest7U7dCD/Zope/lib/python/Zope/Startup/tests/testStarter.py", line 35, in getSchema
    return ZConfig.loadSchema(schemafile)
  File "/tmp/autotest7U7dCD/Zope/lib/python/ZConfig/loader.py", line 37, in loadSchema
    return SchemaLoader().loadURL(url)
  File "/tmp/autotest7U7dCD/Zope/lib/python/ZConfig/loader.py", line 69, in loadURL
    r = self.openResource(url)
  File "/tmp/autotest7U7dCD/Zope/lib/python/ZConfig/loader.py", line 104, in openResource
    raise error
ConfigurationError: error opening resource file:///tmp/autotest7U7dCD/Zope/lib/python/Zope/Startup/zopeschema.xml: [Errno 2] No such file or directory: '/tmp/autotest7U7dCD/Zope/lib/python/Zope/Startup/zopeschema.xml'

Error in test testSetupConfiguredLoggers (Zope.Startup.tests.testStarter.ZopeStarterTestCase)
Traceback (most recent call last):
  File "/tmp/autotest7U7dCD/Zope/lib/python/Zope/Startup/tests/testStarter.py", line 54, in setUp
    ZopeStarterTestCase.schema = getSchema()
  File "/tmp/autotest7U7dCD/Zope/lib/python/Zope/Startup/tests/testStarter.py", line 35, in getSchema
    return ZConfig.loadSchema(schemafile)
  File "/tmp/autotest7U7dCD/Zope/lib/python/ZConfig/loader.py", line 37, in loadSchema
    return SchemaLoader().loadURL(url)
  File "/tmp/autotest7U7dCD/Zope/lib/python/ZConfig/loader.py", line 69, in loadURL
    r = self.openResource(url)
  File "/tmp/autotest7U7dCD/Zope/lib/python/ZConfig/loader.py", line 104, in openResource
    raise error
ConfigurationError: error opening resource file:///tmp/autotest7U7dCD/Zope/lib/python/Zope/Startup/zopeschema.xml: [Errno 2] No such file or directory: '/tmp/autotest7U7dCD/Zope/lib/python/Zope/Startup/zopeschema.xml'

Error in test testSetupLocale (Zope.Startup.tests.testStarter.ZopeStarterTestCase)
Traceback (most recent call last):
  File "/tmp/autotest7U7dCD/Zope/lib/python/Zope/Startup/tests/testStarter.py", line 54, in setUp
    ZopeStarterTestCase.schema = getSchema()
  File "/tmp/autotest7U7dCD/Zope/lib/python/Zope/Startup/tests/testStarter.py", line 35, in getSchema
    return ZConfig.loadSchema(schemafile)
  File "/tmp/autotest7U7dCD/Zope/lib/python/ZConfig/loader.py", line 37, in loadSchema
    return SchemaLoader().loadURL(url)
  File "/tmp/autotest7U7dCD/Zope/lib/python/ZConfig/loader.py", line 69, in loadURL
    r = self.openResource(url)
  File "/tmp/autotest7U7dCD/Zope/lib/python/ZConfig/loader.py", line 104, in openResource
    raise error
ConfigurationError: error opening resource file:///tmp/autotest7U7dCD/Zope/lib/python/Zope/Startup/zopeschema.xml: [Errno 2] No such file or directory: '/tmp/autotest7U7dCD/Zope/lib/python/Zope/Startup/zopeschema.xml'

Error in test testSetupServers (Zope.Startup.tests.testStarter.ZopeStarterTestCase)
Traceback (most recent call last):
  File "/tmp/autotest7U7dCD/Zope/lib/python/Zope/Startup/tests/testStarter.py", line 54, in setUp
    ZopeStarterTestCase.schema = getSchema()
  File "/tmp/autotest7U7dCD/Zope/lib/python/Zope/Startup/tests/testStarter.py", line 35, in getSchema
    return ZConfig.loadSchema(schemafile)
  File "/tmp/autotest7U7dCD/Zope/lib/python/ZConfig/loader.py", line 37, in loadSchema
    return SchemaLoader().loadURL(url)
  File "/tmp/autotest7U7dCD/Zope/lib/python/ZConfig/loader.py", line 69, in loadURL
    r = self.openResource(url)
  File "/tmp/autotest7U7dCD/Zope/lib/python/ZConfig/loader.py", line 104, in openResource
    raise error
ConfigurationError: error opening resource file:///tmp/autotest7U7dCD/Zope/lib/python/Zope/Startup/zopeschema.xml: [Errno 2] No such file or directory: '/tmp/autotest7U7dCD/Zope/lib/python/Zope/Startup/zopeschema.xml'

Error in test testSetupServersWithConflict (Zope.Startup.tests.testStarter.ZopeStarterTestCase)
Traceback (most recent call last):
  File "/tmp/autotest7U7dCD/Zope/lib/python/Zope/Startup/tests/testStarter.py", line 54, in setUp
    ZopeStarterTestCase.schema = getSchema()
  File "/tmp/autotest7U7dCD/Zope/lib/python/Zope/Startup/tests/testStarter.py", line 35, in getSchema
    return ZConfig.loadSchema(schemafile)
  File "/tmp/autotest7U7dCD/Zope/lib/python/ZConfig/loader.py", line 37, in loadSchema
    return SchemaLoader().loadURL(url)
  File "/tmp/autotest7U7dCD/Zope/lib/python/ZConfig/loader.py", line 69, in loadURL
    r = self.openResource(url)
  File "/tmp/autotest7U7dCD/Zope/lib/python/ZConfig/loader.py", line 104, in openResource
    raise error
ConfigurationError: error opening resource file:///tmp/autotest7U7dCD/Zope/lib/python/Zope/Startup/zopeschema.xml: [Errno 2] No such file or directory: '/tmp/autotest7U7dCD/Zope/lib/python/Zope/Startup/zopeschema.xml'

Error in test testSetupStartupHandler (Zope.Startup.tests.testStarter.ZopeStarterTestCase)
Traceback (most recent call last):
  File "/tmp/autotest7U7dCD/Zope/lib/python/Zope/Startup/tests/testStarter.py", line 54, in setUp
    ZopeStarterTestCase.schema = getSchema()
  File "/tmp/autotest7U7dCD/Zope/lib/python/Zope/Startup/tests/testStarter.py", line 35, in getSchema
    return ZConfig.loadSchema(schemafile)
  File "/tmp/autotest7U7dCD/Zope/lib/python/ZConfig/loader.py", line 37, in loadSchema
    return SchemaLoader().loadURL(url)
  File "/tmp/autotest7U7dCD/Zope/lib/python/ZConfig/loader.py", line 69, in loadURL
    r = self.openResource(url)
  File "/tmp/autotest7U7dCD/Zope/lib/python/ZConfig/loader.py", line 104, in openResource
    raise error
ConfigurationError: error opening resource file:///tmp/autotest7U7dCD/Zope/lib/python/Zope/Startup/zopeschema.xml: [Errno 2] No such file or directory: '/tmp/autotest7U7dCD/Zope/lib/python/Zope/Startup/zopeschema.xml'

Error in test testSetupZServerThreads (Zope.Startup.tests.testStarter.ZopeStarterTestCase)
Traceback (most recent call last):
  File "/tmp/autotest7U7dCD/Zope/lib/python/Zope/Startup/tests/testStarter.py", line 54, in setUp
    ZopeStarterTestCase.schema = getSchema()
  File "/tmp/autotest7U7dCD/Zope/lib/python/Zope/Startup/tests/testStarter.py", line 35, in getSchema
    return ZConfig.loadSchema(schemafile)
  File "/tmp/autotest7U7dCD/Zope/lib/python/ZConfig/loader.py", line 37, in loadSchema
    return SchemaLoader().loadURL(url)
  File "/tmp/autotest7U7dCD/Zope/lib/python/ZConfig/loader.py", line 69, in loadURL
    r = self.openResource(url)
  File "/tmp/autotest7U7dCD/Zope/lib/python/ZConfig/loader.py", line 104, in openResource
    raise error
ConfigurationError: error opening resource file:///tmp/autotest7U7dCD/Zope/lib/python/Zope/Startup/zopeschema.xml: [Errno 2] No such file or directory: '/tmp/autotest7U7dCD/Zope/lib/python/Zope/Startup/zopeschema.xml'

======================================================================
ERROR: testBasicHTMLIn (AccessControl.tests.testSecurity.SecurityTests)
----------------------------------------------------------------------
Traceback (most recent call last):
  File "/tmp/autotest7U7dCD/Zope/lib/python/DocumentTemplate/tests/testDTML.py", line 460, in testBasicHTMLIn
    result = self.doc_class(html)(data=data)
  File "/tmp/autotest7U7dCD/Zope/lib/python/Products/PythonScripts/standard.py", line 53, in __call__
    return HTML.__call__(self, client, REQUEST, **kw)
  File "/tmp/autotest7U7dCD/Zope/lib/python/DocumentTemplate/DT_String.py", line 412, in __call__
    self.cook()
  File "/tmp/autotest7U7dCD/Zope/lib/python/DocumentTemplate/DT_String.py", line 340, in cook
    self._v_blocks=self.parse(self.read())
  File "/tmp/autotest7U7dCD/Zope/lib/python/DocumentTemplate/DT_String.py", line 161, in parse
    try: tag, args, command, coname = self._parseTag(mo)
  File "/tmp/autotest7U7dCD/Zope/lib/python/DocumentTemplate/DT_String.py", line 103, in _parseTag
    exec 'from DocumentTemplate.%s import %s' % (module, name) in d
  File "<string>", line 1, in ?
ImportError: No module named DT_In

======================================================================
ERROR: testBasicHTMLIn2 (AccessControl.tests.testSecurity.SecurityTests)
----------------------------------------------------------------------
Traceback (most recent call last):
  File "/tmp/autotest7U7dCD/Zope/lib/python/DocumentTemplate/tests/testDTML.py", line 475, in testBasicHTMLIn2
    result = self.doc_class(html)(xxx=xxx)
  File "/tmp/autotest7U7dCD/Zope/lib/python/Products/PythonScripts/standard.py", line 53, in __call__
    return HTML.__call__(self, client, REQUEST, **kw)
  File "/tmp/autotest7U7dCD/Zope/lib/python/DocumentTemplate/DT_String.py", line 412, in __call__
    self.cook()
  File "/tmp/autotest7U7dCD/Zope/lib/python/DocumentTemplate/DT_String.py", line 340, in cook
    self._v_blocks=self.parse(self.read())
  File "/tmp/autotest7U7dCD/Zope/lib/python/DocumentTemplate/DT_String.py", line 161, in parse
    try: tag, args, command, coname = self._parseTag(mo)
  File "/tmp/autotest7U7dCD/Zope/lib/python/DocumentTemplate/DT_String.py", line 103, in _parseTag
    exec 'from DocumentTemplate.%s import %s' % (module, name) in d
  File "<string>", line 1, in ?
ImportError: No module named DT_In

======================================================================
ERROR: testBasicHTMLIn3 (AccessControl.tests.testSecurity.SecurityTests)
----------------------------------------------------------------------
Traceback (most recent call last):
  File "/tmp/autotest7U7dCD/Zope/lib/python/DocumentTemplate/tests/testDTML.py", line 482, in testBasicHTMLIn3
    result = self.doc_class(html)(None, ns)
  File "/tmp/autotest7U7dCD/Zope/lib/python/Products/PythonScripts/standard.py", line 53, in __call__
    return HTML.__call__(self, client, REQUEST, **kw)
  File "/tmp/autotest7U7dCD/Zope/lib/python/DocumentTemplate/DT_String.py", line 412, in __call__
    self.cook()
  File "/tmp/autotest7U7dCD/Zope/lib/python/DocumentTemplate/DT_String.py", line 340, in cook
    self._v_blocks=self.parse(self.read())
  File "/tmp/autotest7U7dCD/Zope/lib/python/DocumentTemplate/DT_String.py", line 161, in parse
    try: tag, args, command, coname = self._parseTag(mo)
  File "/tmp/autotest7U7dCD/Zope/lib/python/DocumentTemplate/DT_String.py", line 103, in _parseTag
    exec 'from DocumentTemplate.%s import %s' % (module, name) in d
  File "<string>", line 1, in ?
ImportError: No module named DT_In

======================================================================
ERROR: testBasicStringIn (AccessControl.tests.testSecurity.SecurityTests)
----------------------------------------------------------------------
Traceback (most recent call last):
  File "/tmp/autotest7U7dCD/Zope/lib/python/DocumentTemplate/tests/testDTML.py", line 526, in testBasicStringIn
    result = String(s)(data=data)
  File "/tmp/autotest7U7dCD/Zope/lib/python/DocumentTemplate/DT_String.py", line 412, in __call__
    self.cook()
  File "/tmp/autotest7U7dCD/Zope/lib/python/DocumentTemplate/DT_String.py", line 340, in cook
    self._v_blocks=self.parse(self.read())
  File "/tmp/autotest7U7dCD/Zope/lib/python/DocumentTemplate/DT_String.py", line 161, in parse
    try: tag, args, command, coname = self._parseTag(mo)
  File "/tmp/autotest7U7dCD/Zope/lib/python/DocumentTemplate/DT_String.py", line 103, in _parseTag
    exec 'from DocumentTemplate.%s import %s' % (module, name) in d
  File "<string>", line 1, in ?
ImportError: No module named DT_In

======================================================================
ERROR: testBatchingEtc (AccessControl.tests.testSecurity.SecurityTests)
----------------------------------------------------------------------
Traceback (most recent call last):
  File "/tmp/autotest7U7dCD/Zope/lib/python/DocumentTemplate/tests/testDTML.py", line 165, in testBatchingEtc
    html=self.doc_class(read_file('dealers.dtml'))
  File "/tmp/autotest7U7dCD/Zope/lib/python/DocumentTemplate/tests/testDTML.py", line 29, in read_file
    f = open(os.path.join(here, name), 'r')
IOError: [Errno 2] No such file or directory: '/tmp/autotest7U7dCD/Zope/lib/python/DocumentTemplate/tests/dealers.dtml'

======================================================================
ERROR: testHTMLInElse (AccessControl.tests.testSecurity.SecurityTests)
----------------------------------------------------------------------
Traceback (most recent call last):
  File "/tmp/autotest7U7dCD/Zope/lib/python/DocumentTemplate/tests/testDTML.py", line 503, in testHTMLInElse
    result = self.doc_class(html)(xxx=xxx, data={})
  File "/tmp/autotest7U7dCD/Zope/lib/python/Products/PythonScripts/standard.py", line 53, in __call__
    return HTML.__call__(self, client, REQUEST, **kw)
  File "/tmp/autotest7U7dCD/Zope/lib/python/DocumentTemplate/DT_String.py", line 412, in __call__
    self.cook()
  File "/tmp/autotest7U7dCD/Zope/lib/python/DocumentTemplate/DT_String.py", line 340, in cook
    self._v_blocks=self.parse(self.read())
  File "/tmp/autotest7U7dCD/Zope/lib/python/DocumentTemplate/DT_String.py", line 161, in parse
    try: tag, args, command, coname = self._parseTag(mo)
  File "/tmp/autotest7U7dCD/Zope/lib/python/DocumentTemplate/DT_String.py", line 103, in _parseTag
    exec 'from DocumentTemplate.%s import %s' % (module, name) in d
  File "<string>", line 1, in ?
ImportError: No module named DT_In

======================================================================
ERROR: testNoImplicitAccess (AccessControl.tests.testSecurity.SecurityTests)
----------------------------------------------------------------------
Traceback (most recent call last):
  File "/tmp/autotest7U7dCD/Zope/lib/python/AccessControl/tests/testSecurity.py", line 44, in testNoImplicitAccess
    doc(person=person())
  File "/tmp/autotest7U7dCD/Zope/lib/python/Products/PythonScripts/standard.py", line 53, in __call__
    return HTML.__call__(self, client, REQUEST, **kw)
  File "/tmp/autotest7U7dCD/Zope/lib/python/DocumentTemplate/DT_String.py", line 412, in __call__
    self.cook()
  File "/tmp/autotest7U7dCD/Zope/lib/python/DocumentTemplate/DT_String.py", line 340, in cook
    self._v_blocks=self.parse(self.read())
  File "/tmp/autotest7U7dCD/Zope/lib/python/DocumentTemplate/DT_String.py", line 161, in parse
    try: tag, args, command, coname = self._parseTag(mo)
  File "/tmp/autotest7U7dCD/Zope/lib/python/DocumentTemplate/DT_String.py", line 103, in _parseTag
    exec 'from DocumentTemplate.%s import %s' % (module, name) in d
  File "<string>", line 1, in ?
ImportError: No module named DT_With

======================================================================
ERROR: testNoItemPush (AccessControl.tests.testSecurity.SecurityTests)
----------------------------------------------------------------------
Traceback (most recent call last):
  File "/tmp/autotest7U7dCD/Zope/lib/python/DocumentTemplate/tests/testDTML.py", line 436, in testNoItemPush
    result = self.doc_class(html)(data=data)
  File "/tmp/autotest7U7dCD/Zope/lib/python/Products/PythonScripts/standard.py", line 53, in __call__
    return HTML.__call__(self, client, REQUEST, **kw)
  File "/tmp/autotest7U7dCD/Zope/lib/python/DocumentTemplate/DT_String.py", line 412, in __call__
    self.cook()
  File "/tmp/autotest7U7dCD/Zope/lib/python/DocumentTemplate/DT_String.py", line 340, in cook
    self._v_blocks=self.parse(self.read())
  File "/tmp/autotest7U7dCD/Zope/lib/python/DocumentTemplate/DT_String.py", line 161, in parse
    try: tag, args, command, coname = self._parseTag(mo)
  File "/tmp/autotest7U7dCD/Zope/lib/python/DocumentTemplate/DT_String.py", line 103, in _parseTag
    exec 'from DocumentTemplate.%s import %s' % (module, name) in d
  File "<string>", line 1, in ?
ImportError: No module named DT_With

======================================================================
ERROR: testPropogatedError (AccessControl.tests.testSecurity.SecurityTests)
----------------------------------------------------------------------
Traceback (most recent call last):
  File "/tmp/autotest7U7dCD/Zope/lib/python/DocumentTemplate/tests/testDTML.py", line 371, in testPropogatedError
    html(spam=foo())
  File "/tmp/autotest7U7dCD/Zope/lib/python/Products/PythonScripts/standard.py", line 53, in __call__
    return HTML.__call__(self, client, REQUEST, **kw)
  File "/tmp/autotest7U7dCD/Zope/lib/python/DocumentTemplate/DT_String.py", line 412, in __call__
    self.cook()
  File "/tmp/autotest7U7dCD/Zope/lib/python/DocumentTemplate/DT_String.py", line 340, in cook
    self._v_blocks=self.parse(self.read())
  File "/tmp/autotest7U7dCD/Zope/lib/python/DocumentTemplate/DT_String.py", line 170, in parse
    tag, l, args, command)
  File "/tmp/autotest7U7dCD/Zope/lib/python/DocumentTemplate/DT_String.py", line 211, in parse_block
    try: tag, args, command, coname= self._parseTag(mo,scommand,sa)
  File "/tmp/autotest7U7dCD/Zope/lib/python/DocumentTemplate/DT_String.py", line 103, in _parseTag
    exec 'from DocumentTemplate.%s import %s' % (module, name) in d
  File "<string>", line 1, in ?
ImportError: No module named DT_In

======================================================================
ERROR: testRaise (AccessControl.tests.testSecurity.SecurityTests)
----------------------------------------------------------------------
Traceback (most recent call last):
  File "/tmp/autotest7U7dCD/Zope/lib/python/DocumentTemplate/tests/testDTML.py", line 420, in testRaise
    res = self.doc_class(
  File "/tmp/autotest7U7dCD/Zope/lib/python/Products/PythonScripts/standard.py", line 53, in __call__
    return HTML.__call__(self, client, REQUEST, **kw)
  File "/tmp/autotest7U7dCD/Zope/lib/python/DocumentTemplate/DT_String.py", line 412, in __call__
    self.cook()
  File "/tmp/autotest7U7dCD/Zope/lib/python/DocumentTemplate/DT_String.py", line 340, in cook
    self._v_blocks=self.parse(self.read())
  File "/tmp/autotest7U7dCD/Zope/lib/python/DocumentTemplate/DT_String.py", line 161, in parse
    try: tag, args, command, coname = self._parseTag(mo)
  File "/tmp/autotest7U7dCD/Zope/lib/python/DocumentTemplate/DT_String.py", line 103, in _parseTag
    exec 'from DocumentTemplate.%s import %s' % (module, name) in d
  File "<string>", line 1, in ?
ImportError: No module named DT_Raise

======================================================================
ERROR: testSequence1 (AccessControl.tests.testSecurity.SecurityTests)
----------------------------------------------------------------------
Traceback (most recent call last):
  File "/tmp/autotest7U7dCD/Zope/lib/python/DocumentTemplate/tests/testDTML.py", line 236, in testSequence1
    res = html(spam=[[1,2,3],[4,5,6]])
  File "/tmp/autotest7U7dCD/Zope/lib/python/Products/PythonScripts/standard.py", line 53, in __call__
    return HTML.__call__(self, client, REQUEST, **kw)
  File "/tmp/autotest7U7dCD/Zope/lib/python/DocumentTemplate/DT_String.py", line 412, in __call__
    self.cook()
  File "/tmp/autotest7U7dCD/Zope/lib/python/DocumentTemplate/DT_String.py", line 340, in cook
    self._v_blocks=self.parse(self.read())
  File "/tmp/autotest7U7dCD/Zope/lib/python/DocumentTemplate/DT_String.py", line 161, in parse
    try: tag, args, command, coname = self._parseTag(mo)
  File "/tmp/autotest7U7dCD/Zope/lib/python/DocumentTemplate/DT_String.py", line 103, in _parseTag
    exec 'from DocumentTemplate.%s import %s' % (module, name) in d
  File "<string>", line 1, in ?
ImportError: No module named DT_In

======================================================================
ERROR: testSequence2 (AccessControl.tests.testSecurity.SecurityTests)
----------------------------------------------------------------------
Traceback (most recent call last):
  File "/tmp/autotest7U7dCD/Zope/lib/python/DocumentTemplate/tests/testDTML.py", line 244, in testSequence2
    res = html(spam=[[1,2,3],[4,5,6]])
  File "/tmp/autotest7U7dCD/Zope/lib/python/Products/PythonScripts/standard.py", line 53, in __call__
    return HTML.__call__(self, client, REQUEST, **kw)
  File "/tmp/autotest7U7dCD/Zope/lib/python/DocumentTemplate/DT_String.py", line 412, in __call__
    self.cook()
  File "/tmp/autotest7U7dCD/Zope/lib/python/DocumentTemplate/DT_String.py", line 340, in cook
    self._v_blocks=self.parse(self.read())
  File "/tmp/autotest7U7dCD/Zope/lib/python/DocumentTemplate/DT_String.py", line 161, in parse
    try: tag, args, command, coname = self._parseTag(mo)
  File "/tmp/autotest7U7dCD/Zope/lib/python/DocumentTemplate/DT_String.py", line 103, in _parseTag
    exec 'from DocumentTemplate.%s import %s' % (module, name) in d
  File "<string>", line 1, in ?
ImportError: No module named DT_In

======================================================================
ERROR: testSequenceSummaries (AccessControl.tests.testSecurity.SecurityTests)
----------------------------------------------------------------------
Traceback (most recent call last):
  File "/tmp/autotest7U7dCD/Zope/lib/python/DocumentTemplate/tests/testDTML.py", line 198, in testSequenceSummaries
    res = html(data=data)
  File "/tmp/autotest7U7dCD/Zope/lib/python/Products/PythonScripts/standard.py", line 53, in __call__
    return HTML.__call__(self, client, REQUEST, **kw)
  File "/tmp/autotest7U7dCD/Zope/lib/python/DocumentTemplate/DT_String.py", line 412, in __call__
    self.cook()
  File "/tmp/autotest7U7dCD/Zope/lib/python/DocumentTemplate/DT_String.py", line 340, in cook
    self._v_blocks=self.parse(self.read())
  File "/tmp/autotest7U7dCD/Zope/lib/python/DocumentTemplate/DT_String.py", line 161, in parse
    try: tag, args, command, coname = self._parseTag(mo)
  File "/tmp/autotest7U7dCD/Zope/lib/python/DocumentTemplate/DT_String.py", line 103, in _parseTag
    exec 'from DocumentTemplate.%s import %s' % (module, name) in d
  File "<string>", line 1, in ?
ImportError: No module named DT_In

======================================================================
ERROR: testWith (AccessControl.tests.testSecurity.SecurityTests)
----------------------------------------------------------------------
Traceback (most recent call last):
  File "/tmp/autotest7U7dCD/Zope/lib/python/DocumentTemplate/tests/testDTML.py", line 412, in testWith
    res = self.doc_class(
  File "/tmp/autotest7U7dCD/Zope/lib/python/Products/PythonScripts/standard.py", line 53, in __call__
    return HTML.__call__(self, client, REQUEST, **kw)
  File "/tmp/autotest7U7dCD/Zope/lib/python/DocumentTemplate/DT_String.py", line 412, in __call__
    self.cook()
  File "/tmp/autotest7U7dCD/Zope/lib/python/DocumentTemplate/DT_String.py", line 340, in cook
    self._v_blocks=self.parse(self.read())
  File "/tmp/autotest7U7dCD/Zope/lib/python/DocumentTemplate/DT_String.py", line 161, in parse
    try: tag, args, command, coname = self._parseTag(mo)
  File "/tmp/autotest7U7dCD/Zope/lib/python/DocumentTemplate/DT_String.py", line 103, in _parseTag
    exec 'from DocumentTemplate.%s import %s' % (module, name) in d
  File "<string>", line 1, in ?
ImportError: No module named DT_With

======================================================================
ERROR: check JulianDayWeek function
----------------------------------------------------------------------
Traceback (most recent call last):
  File "/tmp/autotest7U7dCD/Zope/lib/python/DateTime/tests/testDateTime.py", line 282, in testJulianWeek
    lines = gzip.GzipFile(fn).readlines()
  File "/usr/local/lib/python2.3/gzip.py", line 94, in __init__
    fileobj = self.myfileobj = __builtin__.open(filename, mode or 'rb')
IOError: [Errno 2] No such file or directory: '/tmp/autotest7U7dCD/Zope/lib/python/DateTime/tests/julian_testdata.txt.gz'

======================================================================
ERROR: testBasicHTMLIn (DocumentTemplate.tests.testDTML.DTMLTests)
----------------------------------------------------------------------
Traceback (most recent call last):
  File "/tmp/autotest7U7dCD/Zope/lib/python/DocumentTemplate/tests/testDTML.py", line 460, in testBasicHTMLIn
    result = self.doc_class(html)(data=data)
  File "/tmp/autotest7U7dCD/Zope/lib/python/DocumentTemplate/DT_String.py", line 412, in __call__
    self.cook()
  File "/tmp/autotest7U7dCD/Zope/lib/python/DocumentTemplate/DT_String.py", line 340, in cook
    self._v_blocks=self.parse(self.read())
  File "/tmp/autotest7U7dCD/Zope/lib/python/DocumentTemplate/DT_String.py", line 161, in parse
    try: tag, args, command, coname = self._parseTag(mo)
  File "/tmp/autotest7U7dCD/Zope/lib/python/DocumentTemplate/DT_String.py", line 103, in _parseTag
    exec 'from DocumentTemplate.%s import %s' % (module, name) in d
  File "<string>", line 1, in ?
ImportError: No module named DT_In

======================================================================
ERROR: testBasicHTMLIn2 (DocumentTemplate.tests.testDTML.DTMLTests)
----------------------------------------------------------------------
Traceback (most recent call last):
  File "/tmp/autotest7U7dCD/Zope/lib/python/DocumentTemplate/tests/testDTML.py", line 475, in testBasicHTMLIn2
    result = self.doc_class(html)(xxx=xxx)
  File "/tmp/autotest7U7dCD/Zope/lib/python/DocumentTemplate/DT_String.py", line 412, in __call__
    self.cook()
  File "/tmp/autotest7U7dCD/Zope/lib/python/DocumentTemplate/DT_String.py", line 340, in cook
    self._v_blocks=self.parse(self.read())
  File "/tmp/autotest7U7dCD/Zope/lib/python/DocumentTemplate/DT_String.py", line 161, in parse
    try: tag, args, command, coname = self._parseTag(mo)
  File "/tmp/autotest7U7dCD/Zope/lib/python/DocumentTemplate/DT_String.py", line 103, in _parseTag
    exec 'from DocumentTemplate.%s import %s' % (module, name) in d
  File "<string>", line 1, in ?
ImportError: No module named DT_In

======================================================================
ERROR: testBasicHTMLIn3 (DocumentTemplate.tests.testDTML.DTMLTests)
----------------------------------------------------------------------
Traceback (most recent call last):
  File "/tmp/autotest7U7dCD/Zope/lib/python/DocumentTemplate/tests/testDTML.py", line 482, in testBasicHTMLIn3
    result = self.doc_class(html)(None, ns)
  File "/tmp/autotest7U7dCD/Zope/lib/python/DocumentTemplate/DT_String.py", line 412, in __call__
    self.cook()
  File "/tmp/autotest7U7dCD/Zope/lib/python/DocumentTemplate/DT_String.py", line 340, in cook
    self._v_blocks=self.parse(self.read())
  File "/tmp/autotest7U7dCD/Zope/lib/python/DocumentTemplate/DT_String.py", line 161, in parse
    try: tag, args, command, coname = self._parseTag(mo)
  File "/tmp/autotest7U7dCD/Zope/lib/python/DocumentTemplate/DT_String.py", line 103, in _parseTag
    exec 'from DocumentTemplate.%s import %s' % (module, name) in d
  File "<string>", line 1, in ?
ImportError: No module named DT_In

======================================================================
ERROR: testBasicStringIn (DocumentTemplate.tests.testDTML.DTMLTests)
----------------------------------------------------------------------
Traceback (most recent call last):
  File "/tmp/autotest7U7dCD/Zope/lib/python/DocumentTemplate/tests/testDTML.py", line 526, in testBasicStringIn
    result = String(s)(data=data)
  File "/tmp/autotest7U7dCD/Zope/lib/python/DocumentTemplate/DT_String.py", line 412, in __call__
    self.cook()
  File "/tmp/autotest7U7dCD/Zope/lib/python/DocumentTemplate/DT_String.py", line 340, in cook
    self._v_blocks=self.parse(self.read())
  File "/tmp/autotest7U7dCD/Zope/lib/python/DocumentTemplate/DT_String.py", line 161, in parse
    try: tag, args, command, coname = self._parseTag(mo)
  File "/tmp/autotest7U7dCD/Zope/lib/python/DocumentTemplate/DT_String.py", line 103, in _parseTag
    exec 'from DocumentTemplate.%s import %s' % (module, name) in d
  File "<string>", line 1, in ?
ImportError: No module named DT_In

======================================================================
ERROR: testBatchingEtc (DocumentTemplate.tests.testDTML.DTMLTests)
----------------------------------------------------------------------
Traceback (most recent call last):
  File "/tmp/autotest7U7dCD/Zope/lib/python/DocumentTemplate/tests/testDTML.py", line 165, in testBatchingEtc
    html=self.doc_class(read_file('dealers.dtml'))
  File "/tmp/autotest7U7dCD/Zope/lib/python/DocumentTemplate/tests/testDTML.py", line 29, in read_file
    f = open(os.path.join(here, name), 'r')
IOError: [Errno 2] No such file or directory: '/tmp/autotest7U7dCD/Zope/lib/python/DocumentTemplate/tests/dealers.dtml'

======================================================================
ERROR: testHTMLInElse (DocumentTemplate.tests.testDTML.DTMLTests)
----------------------------------------------------------------------
Traceback (most recent call last):
  File "/tmp/autotest7U7dCD/Zope/lib/python/DocumentTemplate/tests/testDTML.py", line 503, in testHTMLInElse
    result = self.doc_class(html)(xxx=xxx, data={})
  File "/tmp/autotest7U7dCD/Zope/lib/python/DocumentTemplate/DT_String.py", line 412, in __call__
    self.cook()
  File "/tmp/autotest7U7dCD/Zope/lib/python/DocumentTemplate/DT_String.py", line 340, in cook
    self._v_blocks=self.parse(self.read())
  File "/tmp/autotest7U7dCD/Zope/lib/python/DocumentTemplate/DT_String.py", line 161, in parse
    try: tag, args, command, coname = self._parseTag(mo)
  File "/tmp/autotest7U7dCD/Zope/lib/python/DocumentTemplate/DT_String.py", line 103, in _parseTag
    exec 'from DocumentTemplate.%s import %s' % (module, name) in d
  File "<string>", line 1, in ?
ImportError: No module named DT_In

======================================================================
ERROR: testNoItemPush (DocumentTemplate.tests.testDTML.DTMLTests)
----------------------------------------------------------------------
Traceback (most recent call last):
  File "/tmp/autotest7U7dCD/Zope/lib/python/DocumentTemplate/tests/testDTML.py", line 436, in testNoItemPush
    result = self.doc_class(html)(data=data)
  File "/tmp/autotest7U7dCD/Zope/lib/python/DocumentTemplate/DT_String.py", line 412, in __call__
    self.cook()
  File "/tmp/autotest7U7dCD/Zope/lib/python/DocumentTemplate/DT_String.py", line 340, in cook
    self._v_blocks=self.parse(self.read())
  File "/tmp/autotest7U7dCD/Zope/lib/python/DocumentTemplate/DT_String.py", line 161, in parse
    try: tag, args, command, coname = self._parseTag(mo)
  File "/tmp/autotest7U7dCD/Zope/lib/python/DocumentTemplate/DT_String.py", line 103, in _parseTag
    exec 'from DocumentTemplate.%s import %s' % (module, name) in d
  File "<string>", line 1, in ?
ImportError: No module named DT_With

======================================================================
ERROR: testPropogatedError (DocumentTemplate.tests.testDTML.DTMLTests)
----------------------------------------------------------------------
Traceback (most recent call last):
  File "/tmp/autotest7U7dCD/Zope/lib/python/DocumentTemplate/tests/testDTML.py", line 371, in testPropogatedError
    html(spam=foo())
  File "/tmp/autotest7U7dCD/Zope/lib/python/DocumentTemplate/DT_String.py", line 412, in __call__
    self.cook()
  File "/tmp/autotest7U7dCD/Zope/lib/python/DocumentTemplate/DT_String.py", line 340, in cook
    self._v_blocks=self.parse(self.read())
  File "/tmp/autotest7U7dCD/Zope/lib/python/DocumentTemplate/DT_String.py", line 170, in parse
    tag, l, args, command)
  File "/tmp/autotest7U7dCD/Zope/lib/python/DocumentTemplate/DT_String.py", line 211, in parse_block
    try: tag, args, command, coname= self._parseTag(mo,scommand,sa)
  File "/tmp/autotest7U7dCD/Zope/lib/python/DocumentTemplate/DT_String.py", line 103, in _parseTag
    exec 'from DocumentTemplate.%s import %s' % (module, name) in d
  File "<string>", line 1, in ?
ImportError: No module named DT_In

======================================================================
ERROR: testRaise (DocumentTemplate.tests.testDTML.DTMLTests)
----------------------------------------------------------------------
Traceback (most recent call last):
  File "/tmp/autotest7U7dCD/Zope/lib/python/DocumentTemplate/tests/testDTML.py", line 420, in testRaise
    res = self.doc_class(
  File "/tmp/autotest7U7dCD/Zope/lib/python/DocumentTemplate/DT_String.py", line 412, in __call__
    self.cook()
  File "/tmp/autotest7U7dCD/Zope/lib/python/DocumentTemplate/DT_String.py", line 340, in cook
    self._v_blocks=self.parse(self.read())
  File "/tmp/autotest7U7dCD/Zope/lib/python/DocumentTemplate/DT_String.py", line 161, in parse
    try: tag, args, command, coname = self._parseTag(mo)
  File "/tmp/autotest7U7dCD/Zope/lib/python/DocumentTemplate/DT_String.py", line 103, in _parseTag
    exec 'from DocumentTemplate.%s import %s' % (module, name) in d
  File "<string>", line 1, in ?
ImportError: No module named DT_Raise

======================================================================
ERROR: testSequence1 (DocumentTemplate.tests.testDTML.DTMLTests)
----------------------------------------------------------------------
Traceback (most recent call last):
  File "/tmp/autotest7U7dCD/Zope/lib/python/DocumentTemplate/tests/testDTML.py", line 236, in testSequence1
    res = html(spam=[[1,2,3],[4,5,6]])
  File "/tmp/autotest7U7dCD/Zope/lib/python/DocumentTemplate/DT_String.py", line 412, in __call__
    self.cook()
  File "/tmp/autotest7U7dCD/Zope/lib/python/DocumentTemplate/DT_String.py", line 340, in cook
    self._v_blocks=self.parse(self.read())
  File "/tmp/autotest7U7dCD/Zope/lib/python/DocumentTemplate/DT_String.py", line 161, in parse
    try: tag, args, command, coname = self._parseTag(mo)
  File "/tmp/autotest7U7dCD/Zope/lib/python/DocumentTemplate/DT_String.py", line 103, in _parseTag
    exec 'from DocumentTemplate.%s import %s' % (module, name) in d
  File "<string>", line 1, in ?
ImportError: No module named DT_In

======================================================================
ERROR: testSequence2 (DocumentTemplate.tests.testDTML.DTMLTests)
----------------------------------------------------------------------
Traceback (most recent call last):
  File "/tmp/autotest7U7dCD/Zope/lib/python/DocumentTemplate/tests/testDTML.py", line 244, in testSequence2
    res = html(spam=[[1,2,3],[4,5,6]])
  File "/tmp/autotest7U7dCD/Zope/lib/python/DocumentTemplate/DT_String.py", line 412, in __call__
    self.cook()
  File "/tmp/autotest7U7dCD/Zope/lib/python/DocumentTemplate/DT_String.py", line 340, in cook
    self._v_blocks=self.parse(self.read())
  File "/tmp/autotest7U7dCD/Zope/lib/python/DocumentTemplate/DT_String.py", line 161, in parse
    try: tag, args, command, coname = self._parseTag(mo)
  File "/tmp/autotest7U7dCD/Zope/lib/python/DocumentTemplate/DT_String.py", line 103, in _parseTag
    exec 'from DocumentTemplate.%s import %s' % (module, name) in d
  File "<string>", line 1, in ?
ImportError: No module named DT_In

======================================================================
ERROR: testSequenceSummaries (DocumentTemplate.tests.testDTML.DTMLTests)
----------------------------------------------------------------------
Traceback (most recent call last):
  File "/tmp/autotest7U7dCD/Zope/lib/python/DocumentTemplate/tests/testDTML.py", line 198, in testSequenceSummaries
    res = html(data=data)
  File "/tmp/autotest7U7dCD/Zope/lib/python/DocumentTemplate/DT_String.py", line 412, in __call__
    self.cook()
  File "/tmp/autotest7U7dCD/Zope/lib/python/DocumentTemplate/DT_String.py", line 340, in cook
    self._v_blocks=self.parse(self.read())
  File "/tmp/autotest7U7dCD/Zope/lib/python/DocumentTemplate/DT_String.py", line 161, in parse
    try: tag, args, command, coname = self._parseTag(mo)
  File "/tmp/autotest7U7dCD/Zope/lib/python/DocumentTemplate/DT_String.py", line 103, in _parseTag
    exec 'from DocumentTemplate.%s import %s' % (module, name) in d
  File "<string>", line 1, in ?
ImportError: No module named DT_In

======================================================================
ERROR: testWith (DocumentTemplate.tests.testDTML.DTMLTests)
----------------------------------------------------------------------
Traceback (most recent call last):
  File "/tmp/autotest7U7dCD/Zope/lib/python/DocumentTemplate/tests/testDTML.py", line 412, in testWith
    res = self.doc_class(
  File "/tmp/autotest7U7dCD/Zope/lib/python/DocumentTemplate/DT_String.py", line 412, in __call__
    self.cook()
  File "/tmp/autotest7U7dCD/Zope/lib/python/DocumentTemplate/DT_String.py", line 340, in cook
    self._v_blocks=self.parse(self.read())
  File "/tmp/autotest7U7dCD/Zope/lib/python/DocumentTemplate/DT_String.py", line 161, in parse
    try: tag, args, command, coname = self._parseTag(mo)
  File "/tmp/autotest7U7dCD/Zope/lib/python/DocumentTemplate/DT_String.py", line 103, in _parseTag
    exec 'from DocumentTemplate.%s import %s' % (module, name) in d
  File "<string>", line 1, in ?
ImportError: No module named DT_With

======================================================================
ERROR: testBlech (Interface.tests.testDocument.Test)
----------------------------------------------------------------------
Traceback (most recent call last):
  File "/tmp/autotest7U7dCD/Zope/lib/python/Interface/tests/testDocument.py", line 27, in testBlech
    from Interface.Document import asStructuredText
ImportError: No module named Document

======================================================================
ERROR: testModule (Interface.tests.testVerify.Test)
----------------------------------------------------------------------
Traceback (most recent call last):
  File "/tmp/autotest7U7dCD/Zope/lib/python/Interface/tests/testVerify.py", line 168, in testModule
    from Interface.tests.IFoo import IFoo
ImportError: No module named IFoo

======================================================================
ERROR: testDropPrivileges (Zope.Startup.tests.testStarter.ZopeStarterTestCase)
----------------------------------------------------------------------
Traceback (most recent call last):
  File "/tmp/autotest7U7dCD/Zope/lib/python/Zope/Startup/tests/testStarter.py", line 54, in setUp
    ZopeStarterTestCase.schema = getSchema()
  File "/tmp/autotest7U7dCD/Zope/lib/python/Zope/Startup/tests/testStarter.py", line 35, in getSchema
    return ZConfig.loadSchema(schemafile)
  File "/tmp/autotest7U7dCD/Zope/lib/python/ZConfig/loader.py", line 37, in loadSchema
    return SchemaLoader().loadURL(url)
  File "/tmp/autotest7U7dCD/Zope/lib/python/ZConfig/loader.py", line 69, in loadURL
    r = self.openResource(url)
  File "/tmp/autotest7U7dCD/Zope/lib/python/ZConfig/loader.py", line 104, in openResource
    raise error
ConfigurationError: error opening resource file:///tmp/autotest7U7dCD/Zope/lib/python/Zope/Startup/zopeschema.xml: [Errno 2] No such file or directory: '/tmp/autotest7U7dCD/Zope/lib/python/Zope/Startup/zopeschema.xml'

======================================================================
ERROR: testMakeLockFile (Zope.Startup.tests.testStarter.ZopeStarterTestCase)
----------------------------------------------------------------------
Traceback (most recent call last):
  File "/tmp/autotest7U7dCD/Zope/lib/python/Zope/Startup/tests/testStarter.py", line 54, in setUp
    ZopeStarterTestCase.schema = getSchema()
  File "/tmp/autotest7U7dCD/Zope/lib/python/Zope/Startup/tests/testStarter.py", line 35, in getSchema
    return ZConfig.loadSchema(schemafile)
  File "/tmp/autotest7U7dCD/Zope/lib/python/ZConfig/loader.py", line 37, in loadSchema
    return SchemaLoader().loadURL(url)
  File "/tmp/autotest7U7dCD/Zope/lib/python/ZConfig/loader.py", line 69, in loadURL
    r = self.openResource(url)
  File "/tmp/autotest7U7dCD/Zope/lib/python/ZConfig/loader.py", line 104, in openResource
    raise error
ConfigurationError: error opening resource file:///tmp/autotest7U7dCD/Zope/lib/python/Zope/Startup/zopeschema.xml: [Errno 2] No such file or directory: '/tmp/autotest7U7dCD/Zope/lib/python/Zope/Startup/zopeschema.xml'

======================================================================
ERROR: testMakePidFile (Zope.Startup.tests.testStarter.ZopeStarterTestCase)
----------------------------------------------------------------------
Traceback (most recent call last):
  File "/tmp/autotest7U7dCD/Zope/lib/python/Zope/Startup/tests/testStarter.py", line 54, in setUp
    ZopeStarterTestCase.schema = getSchema()
  File "/tmp/autotest7U7dCD/Zope/lib/python/Zope/Startup/tests/testStarter.py", line 35, in getSchema
    return ZConfig.loadSchema(schemafile)
  File "/tmp/autotest7U7dCD/Zope/lib/python/ZConfig/loader.py", line 37, in loadSchema
    return SchemaLoader().loadURL(url)
  File "/tmp/autotest7U7dCD/Zope/lib/python/ZConfig/loader.py", line 69, in loadURL
    r = self.openResource(url)
  File "/tmp/autotest7U7dCD/Zope/lib/python/ZConfig/loader.py", line 104, in openResource
    raise error
ConfigurationError: error opening resource file:///tmp/autotest7U7dCD/Zope/lib/python/Zope/Startup/zopeschema.xml: [Errno 2] No such file or directory: '/tmp/autotest7U7dCD/Zope/lib/python/Zope/Startup/zopeschema.xml'

======================================================================
ERROR: testSetupConfiguredLoggers (Zope.Startup.tests.testStarter.ZopeStarterTestCase)
----------------------------------------------------------------------
Traceback (most recent call last):
  File "/tmp/autotest7U7dCD/Zope/lib/python/Zope/Startup/tests/testStarter.py", line 54, in setUp
    ZopeStarterTestCase.schema = getSchema()
  File "/tmp/autotest7U7dCD/Zope/lib/python/Zope/Startup/tests/testStarter.py", line 35, in getSchema
    return ZConfig.loadSchema(schemafile)
  File "/tmp/autotest7U7dCD/Zope/lib/python/ZConfig/loader.py", line 37, in loadSchema
    return SchemaLoader().loadURL(url)
  File "/tmp/autotest7U7dCD/Zope/lib/python/ZConfig/loader.py", line 69, in loadURL
    r = self.openResource(url)
  File "/tmp/autotest7U7dCD/Zope/lib/python/ZConfig/loader.py", line 104, in openResource
    raise error
ConfigurationError: error opening resource file:///tmp/autotest7U7dCD/Zope/lib/python/Zope/Startup/zopeschema.xml: [Errno 2] No such file or directory: '/tmp/autotest7U7dCD/Zope/lib/python/Zope/Startup/zopeschema.xml'

======================================================================
ERROR: testSetupLocale (Zope.Startup.tests.testStarter.ZopeStarterTestCase)
----------------------------------------------------------------------
Traceback (most recent call last):
  File "/tmp/autotest7U7dCD/Zope/lib/python/Zope/Startup/tests/testStarter.py", line 54, in setUp
    ZopeStarterTestCase.schema = getSchema()
  File "/tmp/autotest7U7dCD/Zope/lib/python/Zope/Startup/tests/testStarter.py", line 35, in getSchema
    return ZConfig.loadSchema(schemafile)
  File "/tmp/autotest7U7dCD/Zope/lib/python/ZConfig/loader.py", line 37, in loadSchema
    return SchemaLoader().loadURL(url)
  File "/tmp/autotest7U7dCD/Zope/lib/python/ZConfig/loader.py", line 69, in loadURL
    r = self.openResource(url)
  File "/tmp/autotest7U7dCD/Zope/lib/python/ZConfig/loader.py", line 104, in openResource
    raise error
ConfigurationError: error opening resource file:///tmp/autotest7U7dCD/Zope/lib/python/Zope/Startup/zopeschema.xml: [Errno 2] No such file or directory: '/tmp/autotest7U7dCD/Zope/lib/python/Zope/Startup/zopeschema.xml'

======================================================================
ERROR: testSetupServers (Zope.Startup.tests.testStarter.ZopeStarterTestCase)
----------------------------------------------------------------------
Traceback (most recent call last):
  File "/tmp/autotest7U7dCD/Zope/lib/python/Zope/Startup/tests/testStarter.py", line 54, in setUp
    ZopeStarterTestCase.schema = getSchema()
  File "/tmp/autotest7U7dCD/Zope/lib/python/Zope/Startup/tests/testStarter.py", line 35, in getSchema
    return ZConfig.loadSchema(schemafile)
  File "/tmp/autotest7U7dCD/Zope/lib/python/ZConfig/loader.py", line 37, in loadSchema
    return SchemaLoader().loadURL(url)
  File "/tmp/autotest7U7dCD/Zope/lib/python/ZConfig/loader.py", line 69, in loadURL
    r = self.openResource(url)
  File "/tmp/autotest7U7dCD/Zope/lib/python/ZConfig/loader.py", line 104, in openResource
    raise error
ConfigurationError: error opening resource file:///tmp/autotest7U7dCD/Zope/lib/python/Zope/Startup/zopeschema.xml: [Errno 2] No such file or directory: '/tmp/autotest7U7dCD/Zope/lib/python/Zope/Startup/zopeschema.xml'

======================================================================
ERROR: testSetupServersWithConflict (Zope.Startup.tests.testStarter.ZopeStarterTestCase)
----------------------------------------------------------------------
Traceback (most recent call last):
  File "/tmp/autotest7U7dCD/Zope/lib/python/Zope/Startup/tests/testStarter.py", line 54, in setUp
    ZopeStarterTestCase.schema = getSchema()
  File "/tmp/autotest7U7dCD/Zope/lib/python/Zope/Startup/tests/testStarter.py", line 35, in getSchema
    return ZConfig.loadSchema(schemafile)
  File "/tmp/autotest7U7dCD/Zope/lib/python/ZConfig/loader.py", line 37, in loadSchema
    return SchemaLoader().loadURL(url)
  File "/tmp/autotest7U7dCD/Zope/lib/python/ZConfig/loader.py", line 69, in loadURL
    r = self.openResource(url)
  File "/tmp/autotest7U7dCD/Zope/lib/python/ZConfig/loader.py", line 104, in openResource
    raise error
ConfigurationError: error opening resource file:///tmp/autotest7U7dCD/Zope/lib/python/Zope/Startup/zopeschema.xml: [Errno 2] No such file or directory: '/tmp/autotest7U7dCD/Zope/lib/python/Zope/Startup/zopeschema.xml'

======================================================================
ERROR: testSetupStartupHandler (Zope.Startup.tests.testStarter.ZopeStarterTestCase)
----------------------------------------------------------------------
Traceback (most recent call last):
  File "/tmp/autotest7U7dCD/Zope/lib/python/Zope/Startup/tests/testStarter.py", line 54, in setUp
    ZopeStarterTestCase.schema = getSchema()
  File "/tmp/autotest7U7dCD/Zope/lib/python/Zope/Startup/tests/testStarter.py", line 35, in getSchema
    return ZConfig.loadSchema(schemafile)
  File "/tmp/autotest7U7dCD/Zope/lib/python/ZConfig/loader.py", line 37, in loadSchema
    return SchemaLoader().loadURL(url)
  File "/tmp/autotest7U7dCD/Zope/lib/python/ZConfig/loader.py", line 69, in loadURL
    r = self.openResource(url)
  File "/tmp/autotest7U7dCD/Zope/lib/python/ZConfig/loader.py", line 104, in openResource
    raise error
ConfigurationError: error opening resource file:///tmp/autotest7U7dCD/Zope/lib/python/Zope/Startup/zopeschema.xml: [Errno 2] No such file or directory: '/tmp/autotest7U7dCD/Zope/lib/python/Zope/Startup/zopeschema.xml'

======================================================================
ERROR: testSetupZServerThreads (Zope.Startup.tests.testStarter.ZopeStarterTestCase)
----------------------------------------------------------------------
Traceback (most recent call last):
  File "/tmp/autotest7U7dCD/Zope/lib/python/Zope/Startup/tests/testStarter.py", line 54, in setUp
    ZopeStarterTestCase.schema = getSchema()
  File "/tmp/autotest7U7dCD/Zope/lib/python/Zope/Startup/tests/testStarter.py", line 35, in getSchema
    return ZConfig.loadSchema(schemafile)
  File "/tmp/autotest7U7dCD/Zope/lib/python/ZConfig/loader.py", line 37, in loadSchema
    return SchemaLoader().loadURL(url)
  File "/tmp/autotest7U7dCD/Zope/lib/python/ZConfig/loader.py", line 69, in loadURL
    r = self.openResource(url)
  File "/tmp/autotest7U7dCD/Zope/lib/python/ZConfig/loader.py", line 104, in openResource
    raise error
ConfigurationError: error opening resource file:///tmp/autotest7U7dCD/Zope/lib/python/Zope/Startup/zopeschema.xml: [Errno 2] No such file or directory: '/tmp/autotest7U7dCD/Zope/lib/python/Zope/Startup/zopeschema.xml'

======================================================================
FAIL: testMixedModule (AccessControl.tests.testModuleSecurity.SecurityTests)
----------------------------------------------------------------------
Traceback (most recent call last):
  File "/tmp/autotest7U7dCD/Zope/lib/python/AccessControl/tests/testModuleSecurity.py", line 60, in testMixedModule
    self.assertAuth('AccessControl.tests.mixed_module', ())
  File "/tmp/autotest7U7dCD/Zope/lib/python/AccessControl/tests/testModuleSecurity.py", line 49, in assertAuth
    assert 0, ('Did not expose module instance %s, %s' %
AssertionError: Did not expose module instance 'AccessControl.tests.mixed_module', ()

======================================================================
FAIL: testPublicModule (AccessControl.tests.testModuleSecurity.SecurityTests)
----------------------------------------------------------------------
Traceback (most recent call last):
  File "/tmp/autotest7U7dCD/Zope/lib/python/AccessControl/tests/testModuleSecurity.py", line 70, in testPublicModule
    fromlist)
  File "/tmp/autotest7U7dCD/Zope/lib/python/AccessControl/tests/testModuleSecurity.py", line 49, in assertAuth
    assert 0, ('Did not expose module instance %s, %s' %
AssertionError: Did not expose module instance 'AccessControl.tests.public_module', ()

======================================================================
FAIL: checkPackNowWhileWriting (BDBStorage.tests.test_storage_api.FullTest)
----------------------------------------------------------------------
Traceback (most recent call last):
  File "/tmp/autotest7U7dCD/Zope/lib/python/ZODB/tests/PackableStorage.py", line 437, in checkPackNowWhileWriting
    self._PackWhileWriting(pack_now=1)
  File "/tmp/autotest7U7dCD/Zope/lib/python/ZODB/tests/PackableStorage.py", line 420, in _PackWhileWriting
    self.assert_(not t.isAlive())
  File "/usr/local/lib/python2.3/unittest.py", line 278, in failUnless
    if not expr: raise self.failureException, msg
AssertionError

======================================================================
FAIL: test_add_one_file (OFS.tests.testContentTypes.ContentTypesTestCase)
----------------------------------------------------------------------
Traceback (most recent call last):
  File "/tmp/autotest7U7dCD/Zope/lib/python/OFS/tests/testContentTypes.py", line 53, in test_add_one_file
    self.assertEqual(ctype, "text/x-vnd.zope.test-mime-type-1")
  File "/usr/local/lib/python2.3/unittest.py", line 302, in failUnlessEqual
    raise self.failureException, \
AssertionError: 'text/x-unknown-content-type' != 'text/x-vnd.zope.test-mime-type-1'

======================================================================
FAIL: test_add_two_files (OFS.tests.testContentTypes.ContentTypesTestCase)
----------------------------------------------------------------------
Traceback (most recent call last):
  File "/tmp/autotest7U7dCD/Zope/lib/python/OFS/tests/testContentTypes.py", line 64, in test_add_two_files
    self.assertEqual(ctype, "text/x-vnd.zope.test-mime-type-1")
  File "/usr/local/lib/python2.3/unittest.py", line 302, in failUnlessEqual
    raise self.failureException, \
AssertionError: 'text/x-unknown-content-type' != 'text/x-vnd.zope.test-mime-type-1'

----------------------------------------------------------------------
Ran 1112 tests in 3893.496s

FAILED (failures=5, errors=39)



More information about the Zope-Coders mailing list