[Zope-Coders] Linux Test Results - Zope HEAD - failures:1
zope-tests@squishdot.org
zope-tests@squishdot.org
Tue, 07 Jan 2003 03:32:11 +0000
==============================================================================
==============================================================================
Python Version:2.2.2 (#1, Nov 4 2002, 11:01:21)
[GCC 2.95.2 20000220 (Debian GNU/Linux)]
Modules included:
Zope (HEAD)
Exception in thread Connect([(2, ('localhost', 27068))]):
Traceback (most recent call last):
File "/stuff/usr/local/python2.2/Lib/threading.py", line 408, in __bootstrap
self.run()
File "/stuff/chrisw/ZopeTests/sandbox/Zope/lib/python/ZEO/zrpc/client.py", line 290, in run
success = self.try_connecting(attempt_timeout)
File "/stuff/chrisw/ZopeTests/sandbox/Zope/lib/python/ZEO/zrpc/client.py", line 321, in try_connecting
r = self._connect_wrappers(wrappers, deadline)
File "/stuff/chrisw/ZopeTests/sandbox/Zope/lib/python/ZEO/zrpc/client.py", line 383, in _connect_wrappers
wrap.connect_procedure()
File "/stuff/chrisw/ZopeTests/sandbox/Zope/lib/python/ZEO/zrpc/client.py", line 464, in connect_procedure
level=zLOG.WARNING)
File "/stuff/chrisw/ZopeTests/sandbox/Zope/lib/python/ZEO/zrpc/log.py", line 31, in log
zLOG.LOG(label, level, message, error=error)
File "/stuff/chrisw/ZopeTests/sandbox/Zope/lib/python/zLOG/__init__.py", line 140, in LOG
log_write(subsystem, severity, summary, detail, error)
File "testTextIndex.py", line 19, in log_write
AssertionError: zrpc:19656(100): CW: error connecting to ('localhost', 27068): ECONNREFUSED
======================================================================
FAIL: checkNoVerificationOnServerRestartWith2Clients (testConnection.FileStorageReconnectionTests)
----------------------------------------------------------------------
Traceback (most recent call last):
File "/stuff/chrisw/ZopeTests/sandbox/Zope/lib/python/ZEO/tests/ConnectionTests.py", line 613, in checkNoVerificationOnServerRestartWith2Clients
self.assertEqual(perstorage.verify_result, "no verification")
File "/stuff/usr/local/python2.2/Lib/unittest.py", line 286, in failUnlessEqual
raise self.failureException, \
AssertionError: None != 'no verification'
----------------------------------------------------------------------
Ran 1897 tests in 971.528s
FAILED (failures=1)
======================================================================
OVERALL FAILED (total failures=1)