[Zope-Coders] Win32 Tests - Zope HEAD - failures:1 errors:1

zope-tests@squishdot.org zope-tests@squishdot.org
Thu, 09 Jan 2003 02:19:37 +0000


==============================================================================
==============================================================================
Python Version:2.2.2 (#37, Oct 14 2002, 17:02:34) [MSC 32 bit (Intel)]

Modules included:
Zope (HEAD)

Exception exceptions.OSError: (13, 'Permission denied', 'C:\\DOCUME~1\\CHRISW~1\\LOCALS~1\\Temp\\~2080-148.inv') in <bound method TemporaryFileWrapper.__del__ of <closed file 'C:\DOCUME~1\CHRISW~1\LOCALS~1\Temp\~2080-148.inv', mode 'w+b' at 0x02A8BB18>> ignored
======================================================================
ERROR: test_zeo_config (testConfig.ZODBConfigTest)
----------------------------------------------------------------------
Traceback (most recent call last):
  File "testConfig.py", line 77, in test_zeo_config
  File "c:\python22\lib\unittest.py", line 273, in failUnlessRaises
    apply(callableObj, args, kwargs)
  File "testConfig.py", line 31, in _test
  File "testConfig.py", line 28, in _opendb
  File "D:\ZopeTests\sandbox\Zope\lib\python\ZODB\config.py", line 35, in databaseFromString
    return databaseFromFile(StringIO.StringIO(s))
  File "D:\ZopeTests\sandbox\Zope\lib\python\ZODB\config.py", line 39, in databaseFromFile
    return databaseFromConfig(config)
  File "D:\ZopeTests\sandbox\Zope\lib\python\ZODB\config.py", line 46, in databaseFromConfig
    return ZODB.DB(config.storage.open(),
  File "D:\ZopeTests\sandbox\Zope\lib\python\ZODB\config.py", line 106, in open
    read_only_fallback=self.config.read_only_fallback)
  File "D:\ZopeTests\sandbox\Zope\lib\python\ZEO\ClientStorage.py", line 257, in __init__
    tmax=max_disconnect_poll)
  File "D:\ZopeTests\sandbox\Zope\lib\python\ZEO\zrpc\client.py", line 35, in __init__
    self.addrlist = self._parse_addrs(addrs)
  File "D:\ZopeTests\sandbox\Zope\lib\python\ZEO\zrpc\client.py", line 66, in _parse_addrs
    addr_type = self._guess_type(addr)
  File "D:\ZopeTests\sandbox\Zope\lib\python\ZEO\zrpc\client.py", line 75, in _guess_type
    return socket.AF_UNIX
AttributeError: 'module' object has no attribute 'AF_UNIX'

======================================================================
FAIL: checkNoVerificationOnServerRestartWith2Clients (testConnection.FileStorageReconnectionTests)
----------------------------------------------------------------------
Traceback (most recent call last):
  File "D:\ZopeTests\sandbox\Zope\lib\python\ZEO\tests\ConnectionTests.py", line 614, in checkNoVerificationOnServerRestartWith2Clients
    self.assertEqual(perstorage.verify_result, "no verification")
  File "c:\python22\lib\unittest.py", line 286, in failUnlessEqual
    raise self.failureException, \
AssertionError: None != 'no verification'

----------------------------------------------------------------------
Ran 1894 tests in 421.656s

FAILED (failures=1, errors=1)

======================================================================
OVERALL FAILED (total failures=1, total errors=1)