[Zope-Coders] Win32 Tests - Zope HEAD - failures:2

zope-tests@squishdot.org zope-tests@squishdot.org
Thu, 23 Jan 2003 02:22:33 +0000


==============================================================================
==============================================================================
Python Version:2.2.2 (#37, Oct 14 2002, 17:02:34) [MSC 32 bit (Intel)]

Modules included:
Zope (HEAD)

======================================================================
FAIL: checkNoVerificationOnServerRestartWith2Clients (testConnection.FileStorageReconnectionTests)
----------------------------------------------------------------------
Traceback (most recent call last):
  File "D:\ZopeTests\sandbox\Zope\lib\python\ZEO\tests\ConnectionTests.py", line 655, in checkNoVerificationOnServerRestartWith2Clients
    self.assertEqual(perstorage.verify_result, "no verification")
  File "c:\python22\lib\unittest.py", line 286, in failUnlessEqual
    raise self.failureException, \
AssertionError: None != 'no verification'

======================================================================
FAIL: test_zeo_config (testConfig.ZODBConfigTest)
----------------------------------------------------------------------
Traceback (most recent call last):
  File "testConfig.py", line 84, in test_zeo_config
  File "c:\python22\lib\unittest.py", line 254, in fail
    raise self.failureException, msg
AssertionError: This test hangs on Debian Linux 2.4.20 i686 unknown

----------------------------------------------------------------------
Ran 2079 tests in 782.109s

FAILED (failures=2)

======================================================================
OVERALL FAILED (total failures=2)