[Zope-Coders] Linux Test Results - Zope HEAD - failures:1

zope-tests@squishdot.org zope-tests@squishdot.org
Thu, 23 Jan 2003 03:42:19 +0000


==============================================================================
==============================================================================
Python Version:2.2.2 (#1, Nov  4 2002, 11:01:21) 
[GCC 2.95.2 20000220 (Debian GNU/Linux)]

Modules included:
Zope (HEAD)

======================================================================
FAIL: test_zeo_config (testConfig.ZODBConfigTest)
----------------------------------------------------------------------
Traceback (most recent call last):
  File "testConfig.py", line 84, in test_zeo_config
  File "/stuff/usr/local/python2.2/Lib/unittest.py", line 254, in fail
    raise self.failureException, msg
AssertionError: This test hangs on Debian Linux 2.4.20 i686 unknown

----------------------------------------------------------------------
Ran 2087 tests in 1811.321s

FAILED (failures=1)

======================================================================
OVERALL FAILED (total failures=1)