[Zope-Coders] Win32 Tests - Zope HEAD - failures:1 errors:1
zope-tests@squishdot.org
zope-tests@squishdot.org
Fri, 24 Jan 2003 02:22:14 +0000
==============================================================================
==============================================================================
Python Version:2.2.2 (#37, Oct 14 2002, 17:02:34) [MSC 32 bit (Intel)]
Modules included:
Zope (HEAD)
======================================================================
ERROR: testInterface (testZCTextIndex.CosineIndexTests)
----------------------------------------------------------------------
Traceback (most recent call last):
File "testZCTextIndex.py", line 203, in testInterface
File "D:\ZopeTests\sandbox\Zope\lib\python\Interface\Verify.py", line 70, in verifyClass
return _verify(iface, candidate, tentative, vtype='c')
File "D:\ZopeTests\sandbox\Zope\lib\python\Interface\Verify.py", line 49, in _verify
raise BrokenImplementation(iface, n)
BrokenImplementation: An object has failed to implement interface <Interface Products.PluginIndexes.common.PluggableIndex.PluggableIndexInterface at ae7c18>
The getIndexSourceNames attribute was not provided.
======================================================================
FAIL: checkNoVerificationOnServerRestartWith2Clients (testConnection.FileStorageReconnectionTests)
----------------------------------------------------------------------
Traceback (most recent call last):
File "D:\ZopeTests\sandbox\Zope\lib\python\ZEO\tests\ConnectionTests.py", line 655, in checkNoVerificationOnServerRestartWith2Clients
self.assertEqual(perstorage.verify_result, "no verification")
File "c:\python22\lib\unittest.py", line 286, in failUnlessEqual
raise self.failureException, \
AssertionError: None != 'no verification'
----------------------------------------------------------------------
Ran 2087 tests in 779.172s
FAILED (failures=1, errors=1)
======================================================================
OVERALL FAILED (total failures=1, total errors=1)