[Zope-Coders] Can 'someone' fix the ZEO tests failing on the Zope HEAD? ;-)
Chris Withers
chrisw@nipltd.com
Tue, 10 Jun 2003 13:31:58 +0100
cheers,
Chris
zope-tests@squishdot.org wrote:
> ======================================================================
> Python Version:2.2.2 (#37, Oct 14 2002, 17:02:34) [MSC 32 bit (Intel)]
>
> Modules included:
> Zope (HEAD)
>
> Exception in thread Thread-75:
> Traceback (most recent call last):
> File "c:\python22\lib\threading.py", line 408, in __bootstrap
> self.run()
> File "D:\ZopeTests\sandbox\Zope\lib\python\ZEO\tests\ThreadTests.py", line 58, in run
> self.storage.tpc_finish(self.trans)
> File "D:\ZopeTests\sandbox\Zope\lib\python\ZEO\ClientStorage.py", line 870, in tpc_finish
> self._update_cache()
> File "D:\ZopeTests\sandbox\Zope\lib\python\ZEO\ClientStorage.py", line 893, in _update_cache
> self._cache.checkSize(self._tbuf.get_size())
> AttributeError: 'NoneType' object has no attribute 'checkSize'
>
> Exception in thread Thread-85:
> Traceback (most recent call last):
> File "c:\python22\lib\threading.py", line 408, in __bootstrap
> self.run()
> File "D:\ZopeTests\sandbox\Zope\lib\python\ZEO\tests\ThreadTests.py", line 58, in run
> self.storage.tpc_finish(self.trans)
> File "D:\ZopeTests\sandbox\Zope\lib\python\ZEO\ClientStorage.py", line 870, in tpc_finish
> self._update_cache()
> File "D:\ZopeTests\sandbox\Zope\lib\python\ZEO\ClientStorage.py", line 893, in _update_cache
> self._cache.checkSize(self._tbuf.get_size())
> AttributeError: 'NoneType' object has no attribute 'checkSize'
>
> Exception in thread Thread-120:
> Traceback (most recent call last):
> File "c:\python22\lib\threading.py", line 408, in __bootstrap
> self.run()
> File "D:\ZopeTests\sandbox\Zope\lib\python\ZEO\tests\ThreadTests.py", line 58, in run
> self.storage.tpc_finish(self.trans)
> File "D:\ZopeTests\sandbox\Zope\lib\python\ZEO\ClientStorage.py", line 870, in tpc_finish
> self._update_cache()
> File "D:\ZopeTests\sandbox\Zope\lib\python\ZEO\ClientStorage.py", line 893, in _update_cache
> self._cache.checkSize(self._tbuf.get_size())
> AttributeError: 'NoneType' object has no attribute 'checkSize'
>
> Exception in thread Thread-130:
> Traceback (most recent call last):
> File "c:\python22\lib\threading.py", line 408, in __bootstrap
> self.run()
> File "D:\ZopeTests\sandbox\Zope\lib\python\ZEO\tests\ThreadTests.py", line 58, in run
> self.storage.tpc_finish(self.trans)
> File "D:\ZopeTests\sandbox\Zope\lib\python\ZEO\ClientStorage.py", line 870, in tpc_finish
> self._update_cache()
> File "D:\ZopeTests\sandbox\Zope\lib\python\ZEO\ClientStorage.py", line 893, in _update_cache
> self._cache.checkSize(self._tbuf.get_size())
> AttributeError: 'NoneType' object has no attribute 'checkSize'
>
> No handlers could be found for logger "event"
> ======================================================================
> FAIL: checkDisconnectedOnThread2Close (testZEO.FileStorageTests)
> ----------------------------------------------------------------------
> Traceback (most recent call last):
> File "D:\ZopeTests\sandbox\Zope\lib\python\ZEO\tests\ThreadTests.py", line 90, in checkDisconnectedOnThread2Close
> self.assertEqual(thread1.gotValueError, 1)
> File "c:\python22\lib\unittest.py", line 286, in failUnlessEqual
> raise self.failureException, \
> AssertionError: 0 != 1
>
> ======================================================================
> FAIL: checkSecondBeginFails (testZEO.FileStorageTests)
> ----------------------------------------------------------------------
> Traceback (most recent call last):
> File "D:\ZopeTests\sandbox\Zope\lib\python\ZEO\tests\ThreadTests.py", line 111, in checkSecondBeginFails
> self.assertEqual(thread1.gotValueError, 1)
> File "c:\python22\lib\unittest.py", line 286, in failUnlessEqual
> raise self.failureException, \
> AssertionError: 0 != 1
>
> ======================================================================
> FAIL: checkDisconnectedOnThread2Close (testZEO.MappingStorageTests)
> ----------------------------------------------------------------------
> Traceback (most recent call last):
> File "D:\ZopeTests\sandbox\Zope\lib\python\ZEO\tests\ThreadTests.py", line 90, in checkDisconnectedOnThread2Close
> self.assertEqual(thread1.gotValueError, 1)
> File "c:\python22\lib\unittest.py", line 286, in failUnlessEqual
> raise self.failureException, \
> AssertionError: 0 != 1
>
> ======================================================================
> FAIL: checkSecondBeginFails (testZEO.MappingStorageTests)
> ----------------------------------------------------------------------
> Traceback (most recent call last):
> File "D:\ZopeTests\sandbox\Zope\lib\python\ZEO\tests\ThreadTests.py", line 111, in checkSecondBeginFails
> self.assertEqual(thread1.gotValueError, 1)
> File "c:\python22\lib\unittest.py", line 286, in failUnlessEqual
> raise self.failureException, \
> AssertionError: 0 != 1
>
> ----------------------------------------------------------------------
> Ran 2209 tests in 1009.844s
>
> FAILED (failures=4)
>
> ======================================================================
> OVERALL FAILED (total failures=4)
> Unhandled exception in thread:
> Traceback (most recent call last):
> File "c:\python22\lib\threading.py", line 415, in __bootstrap
> s = _StringIO()
> File "C:\PYTHON22\lib\StringIO.py", line 53, in __init__
> if type(buf) not in types.StringTypes:
> AttributeError: 'NoneType' object has no attribute 'StringTypes'
>
>
> _______________________________________________
> Zope-Coders mailing list
> Zope-Coders@zope.org
> http://mail.zope.org/mailman/listinfo/zope-coders
>
>