[Zope-Coders] Win32 Tests - Zope HEAD - failures:4 errors:2

zope-tests at squishdot.org zope-tests at squishdot.org
Wed Nov 5 00:09:55 EST 2003


======================================================================
Python Version:2.2.3 (#42, May 30 2003, 18:12:08) [MSC 32 bit (Intel)]

Modules included:
Zope (HEAD)

Running unit tests from C:\ZopeTests\sandbox\Zope
C:\ZopeTests\sandbox\Zope\lib/python\Products\PluginIndexes\DateRangeIndex\tests\test_DateRangeIndex.py:120: OverflowWarning: integer addition
  bad = Dummy( 'bad', sys.maxint + 1, sys.maxint + 1 )
Failure in test testEmpty (Products.PluginIndexes.PathIndex.tests.testPathIndex.TestCase)
Traceback (most recent call last):
  File "C:\ZopeTests\sandbox\Zope\lib/python\Products\PluginIndexes\PathIndex\tests\testPathIndex.py", line 64, in testEmpty
    self.assertEqual(self._index.numObjects() ,0)
  File "C:\Python22\lib\unittest.py", line 286, in failUnlessEqual
    raise self.failureException, \
AssertionError: <Length instance at 026A1730> != 0

Failure in test testReindex (Products.PluginIndexes.PathIndex.tests.testPathIndex.TestCase)
Traceback (most recent call last):
  File "C:\ZopeTests\sandbox\Zope\lib/python\Products\PluginIndexes\PathIndex\tests\testPathIndex.py", line 82, in testReindex
    self.assertEqual(self._index.numObjects(), 18)
  File "C:\Python22\lib\unittest.py", line 286, in failUnlessEqual
    raise self.failureException, \
AssertionError: <Length instance at 026C2AB0> != 18

Failure in test testUnIndex (Products.PluginIndexes.PathIndex.tests.testPathIndex.TestCase)
Traceback (most recent call last):
  File "C:\ZopeTests\sandbox\Zope\lib/python\Products\PluginIndexes\PathIndex\tests\testPathIndex.py", line 71, in testUnIndex
    self.assertEqual(self._index.numObjects(), 18)
  File "C:\Python22\lib\unittest.py", line 286, in failUnlessEqual
    raise self.failureException, \
AssertionError: <Length instance at 0262BD60> != 18

Error in test testMakeLockFile (Zope.Startup.tests.testStarter.ZopeStarterTestCase)
Traceback (most recent call last):
  File "C:\ZopeTests\sandbox\Zope\lib/python\Zope\Startup\tests\testStarter.py", line 280, in testMakeLockFile
    self.failIf(open(name).read().find('hello') > -1)
IOError: [Errno 13] Permission denied

Error in test testSetupLocale (Zope.Startup.tests.testStarter.ZopeStarterTestCase)
Traceback (most recent call last):
  File "C:\ZopeTests\sandbox\Zope\lib/python\Zope\Startup\tests\testStarter.py", line 91, in testSetupLocale
    conf = self.load_config_text("locale fr_FR")
  File "C:\ZopeTests\sandbox\Zope\lib/python\Zope\Startup\tests\testStarter.py", line 83, in load_config_text
    conf, handler = ZConfig.loadConfigFile(schema, sio)
  File "C:\ZopeTests\sandbox\Zope\lib/python\ZConfig\loader.py", line 46, in loadConfigFile
    return _get_config_loader(schema, overrides).loadFile(file, url)
  File "C:\ZopeTests\sandbox\Zope\lib/python\ZConfig\loader.py", line 80, in loadFile
    return self.loadResource(r)
  File "C:\ZopeTests\sandbox\Zope\lib/python\ZConfig\loader.py", line 184, in loadResource
    result = sm.finish(), CompositeHandler(sm.handlers, self.schema)
  File "C:\ZopeTests\sandbox\Zope\lib/python\ZConfig\matcher.py", line 242, in finish
    v = BaseMatcher.finish(self)
  File "C:\ZopeTests\sandbox\Zope\lib/python\ZConfig\matcher.py", line 170, in finish
    return self.constuct()
  File "C:\ZopeTests\sandbox\Zope\lib/python\ZConfig\matcher.py", line 212, in constuct
    v = v.convert(ci.datatype)
  File "C:\ZopeTests\sandbox\Zope\lib/python\ZConfig\info.py", line 67, in convert
    raise ZConfig.DataConversionError(e, self.value, self.position)
DataConversionError: The specified locale "fr_FR" is not supported by your system.
See your operating system documentation for more
information on locale support. (line 2)

Failure in test testSetupServersWithConflict (Zope.Startup.tests.testStarter.ZopeStarterTestCase)
Traceback (most recent call last):
  File "C:\ZopeTests\sandbox\Zope\lib/python\Zope\Startup\tests\testStarter.py", line 186, in testSetupServersWithConflict
    self.assertRaises(ZConfig.ConfigurationError, starter.setupServers)
  File "C:\Python22\lib\unittest.py", line 279, in failUnlessRaises
    raise self.failureException, excName
AssertionError: ConfigurationError

======================================================================
ERROR: testMakeLockFile (Zope.Startup.tests.testStarter.ZopeStarterTestCase)
----------------------------------------------------------------------
Traceback (most recent call last):
  File "C:\ZopeTests\sandbox\Zope\lib/python\Zope\Startup\tests\testStarter.py", line 280, in testMakeLockFile
    self.failIf(open(name).read().find('hello') > -1)
IOError: [Errno 13] Permission denied

======================================================================
ERROR: testSetupLocale (Zope.Startup.tests.testStarter.ZopeStarterTestCase)
----------------------------------------------------------------------
Traceback (most recent call last):
  File "C:\ZopeTests\sandbox\Zope\lib/python\Zope\Startup\tests\testStarter.py", line 91, in testSetupLocale
    conf = self.load_config_text("locale fr_FR")
  File "C:\ZopeTests\sandbox\Zope\lib/python\Zope\Startup\tests\testStarter.py", line 83, in load_config_text
    conf, handler = ZConfig.loadConfigFile(schema, sio)
  File "C:\ZopeTests\sandbox\Zope\lib/python\ZConfig\loader.py", line 46, in loadConfigFile
    return _get_config_loader(schema, overrides).loadFile(file, url)
  File "C:\ZopeTests\sandbox\Zope\lib/python\ZConfig\loader.py", line 80, in loadFile
    return self.loadResource(r)
  File "C:\ZopeTests\sandbox\Zope\lib/python\ZConfig\loader.py", line 184, in loadResource
    result = sm.finish(), CompositeHandler(sm.handlers, self.schema)
  File "C:\ZopeTests\sandbox\Zope\lib/python\ZConfig\matcher.py", line 242, in finish
    v = BaseMatcher.finish(self)
  File "C:\ZopeTests\sandbox\Zope\lib/python\ZConfig\matcher.py", line 170, in finish
    return self.constuct()
  File "C:\ZopeTests\sandbox\Zope\lib/python\ZConfig\matcher.py", line 212, in constuct
    v = v.convert(ci.datatype)
  File "C:\ZopeTests\sandbox\Zope\lib/python\ZConfig\info.py", line 67, in convert
    raise ZConfig.DataConversionError(e, self.value, self.position)
DataConversionError: The specified locale "fr_FR" is not supported by your system.
See your operating system documentation for more
information on locale support. (line 2)

======================================================================
FAIL: testEmpty (Products.PluginIndexes.PathIndex.tests.testPathIndex.TestCase)
----------------------------------------------------------------------
Traceback (most recent call last):
  File "C:\ZopeTests\sandbox\Zope\lib/python\Products\PluginIndexes\PathIndex\tests\testPathIndex.py", line 64, in testEmpty
    self.assertEqual(self._index.numObjects() ,0)
  File "C:\Python22\lib\unittest.py", line 286, in failUnlessEqual
    raise self.failureException, \
AssertionError: <Length instance at 026A1730> != 0

======================================================================
FAIL: testReindex (Products.PluginIndexes.PathIndex.tests.testPathIndex.TestCase)
----------------------------------------------------------------------
Traceback (most recent call last):
  File "C:\ZopeTests\sandbox\Zope\lib/python\Products\PluginIndexes\PathIndex\tests\testPathIndex.py", line 82, in testReindex
    self.assertEqual(self._index.numObjects(), 18)
  File "C:\Python22\lib\unittest.py", line 286, in failUnlessEqual
    raise self.failureException, \
AssertionError: <Length instance at 026C2AB0> != 18

======================================================================
FAIL: testUnIndex (Products.PluginIndexes.PathIndex.tests.testPathIndex.TestCase)
----------------------------------------------------------------------
Traceback (most recent call last):
  File "C:\ZopeTests\sandbox\Zope\lib/python\Products\PluginIndexes\PathIndex\tests\testPathIndex.py", line 71, in testUnIndex
    self.assertEqual(self._index.numObjects(), 18)
  File "C:\Python22\lib\unittest.py", line 286, in failUnlessEqual
    raise self.failureException, \
AssertionError: <Length instance at 0262BD60> != 18

======================================================================
FAIL: testSetupServersWithConflict (Zope.Startup.tests.testStarter.ZopeStarterTestCase)
----------------------------------------------------------------------
Traceback (most recent call last):
  File "C:\ZopeTests\sandbox\Zope\lib/python\Zope\Startup\tests\testStarter.py", line 186, in testSetupServersWithConflict
    self.assertRaises(ZConfig.ConfigurationError, starter.setupServers)
  File "C:\Python22\lib\unittest.py", line 279, in failUnlessRaises
    raise self.failureException, excName
AssertionError: ConfigurationError

----------------------------------------------------------------------
Ran 2590 tests in 3259.125s

FAILED (failures=4, errors=2)




More information about the Zope-Coders mailing list