[Zope-Coders] Linux Test Results - 2_7-branch/Py2.2 - failures:1 errors:2

zope-tests at plope.com zope-tests at plope.com
Thu Nov 13 18:19:31 EST 2003


======================================================================
Python Version:2.2.3 (#1, Aug  2 2003, 16:03:27) 
[GCC 3.2 20020903 (Red Hat Linux 8.0 3.2-7)]

Modules included:
Zope (Zope-2_7-branch)

Running unit tests from /home/chrism/opt/tests/sandbox/Zope

/home/chrism/opt/tests/sandbox/Zope/lib/python/Products/PluginIndexes/DateRangeIndex/tests/test_DateRangeIndex.py:120: OverflowWarning: integer addition
  bad = Dummy( 'bad', sys.maxint + 1, sys.maxint + 1 )
Traceback (most recent call last):
  File "/home/chrism/opt/tests/sandbox/Zope/lib/python/TAL/runtest.py", line 92, in main
    driver.main()
  File "/home/chrism/opt/tests/sandbox/Zope/lib/python/TAL/driver.py", line 151, in main
    it = compilefile(file, mode)
  File "/home/chrism/opt/tests/sandbox/Zope/lib/python/TAL/driver.py", line 190, in compilefile
    p.parseFile(file)
  File "/home/chrism/opt/tests/sandbox/Zope/lib/python/TAL/XMLParser.py", line 77, in parseFile
    self.parseStream(open(filename))
  File "/home/chrism/opt/tests/sandbox/Zope/lib/python/TAL/XMLParser.py", line 87, in parseStream
    self.parser.ParseFile(stream)
ExpatError: undefined entity: line 18, column 2
Failure in test runTest (TAL.tests.test_files.FileTestCase)
Traceback (most recent call last):
  File "/home/chrism/opt/tests/sandbox/Zope/lib/python/TAL/tests/test_files.py", line 41, in runTest
    self.fail("output for %s didn't match" % self.__file)
  File "/home/chrism/opt/Python-2.2.3/lib/python2.2/unittest.py", line 254, in fail
    raise self.failureException, msg
AssertionError: output for /home/chrism/opt/tests/sandbox/Zope/lib/python/TAL/tests/input/test01.xml didn't match

Error in test checkPackWhileWriting (ZODB.tests.testFileStorage.FileStorageTests)
Traceback (most recent call last):
  File "/home/chrism/opt/tests/sandbox/Zope/lib/python/ZODB/tests/PackableStorage.py", line 433, in checkPackWhileWriting
    self._PackWhileWriting(pack_now=0)
  File "/home/chrism/opt/tests/sandbox/Zope/lib/python/ZODB/tests/PackableStorage.py", line 413, in _PackWhileWriting
    db.pack(packt)
  File "/home/chrism/opt/tests/sandbox/Zope/lib/python/ZODB/DB.py", line 528, in pack
    try: self._storage.pack(t,referencesf)
  File "/home/chrism/opt/tests/sandbox/Zope/lib/python/ZODB/FileStorage.py", line 1557, in pack
    opos = p.pack()
  File "/home/chrism/opt/tests/sandbox/Zope/lib/python/ZODB/fspack.py", line 678, in pack
    self.gc.findReachable()
  File "/home/chrism/opt/tests/sandbox/Zope/lib/python/ZODB/fspack.py", line 460, in findReachable
    self.findReachableFromFuture()
  File "/home/chrism/opt/tests/sandbox/Zope/lib/python/ZODB/fspack.py", line 535, in findReachableFromFuture
    self.checkTxn(th, pos)
  File "/home/chrism/opt/tests/sandbox/Zope/lib/python/ZODB/fspack.py", line 172, in checkTxn
    self.fail(pos, "transaction with checkpoint flag set")
  File "/home/chrism/opt/tests/sandbox/Zope/lib/python/ZODB/fspack.py", line 164, in fail
    raise CorruptedError(s)
CorruptedError: FileStorageTests.fs:30963:transaction with checkpoint flag set

Exception in thread Thread-157:
Traceback (most recent call last):
  File "/home/chrism/opt/Python-2.2.3/lib/python2.2/threading.py", line 414, in __bootstrap
    self.run()
  File "/home/chrism/opt/tests/sandbox/Zope/lib/python/ZODB/tests/PackableStorage.py", line 517, in run
    get_transaction().commit()
  File "/home/chrism/opt/tests/sandbox/Zope/lib/python/ZODB/Transaction.py", line 250, in commit
    self._finish_one(jars[0])
  File "/home/chrism/opt/tests/sandbox/Zope/lib/python/ZODB/Transaction.py", line 355, in _finish_one
    jar.tpc_finish(self)
  File "/home/chrism/opt/tests/sandbox/Zope/lib/python/ZODB/Connection.py", line 765, in tpc_finish
    self._storage.tpc_finish(transaction, callback)
  File "/home/chrism/opt/tests/sandbox/Zope/lib/python/ZODB/BaseStorage.py", line 205, in tpc_finish
    self._clear_temp()
  File "/home/chrism/opt/tests/sandbox/Zope/lib/python/ZODB/FileStorage.py", line 999, in _clear_temp
    self._tfile.seek(0)
ValueError: I/O operation on closed file

Exception in thread Thread-159:
Traceback (most recent call last):
  File "/home/chrism/opt/Python-2.2.3/lib/python2.2/threading.py", line 414, in __bootstrap
    self.run()
  File "/home/chrism/opt/tests/sandbox/Zope/lib/python/ZODB/tests/PackableStorage.py", line 516, in run
    self.root[j % 10].value = MinPO(j)
  File "/home/chrism/opt/Python-2.2.3/lib/python2.2/UserDict.py", line 14, in __getitem__
    def __getitem__(self, key): return self.data[key]
  File "/home/chrism/opt/tests/sandbox/Zope/lib/python/ZODB/Connection.py", line 561, in setstate
    p, serial = self._storage.load(oid, self._version)
  File "/home/chrism/opt/tests/sandbox/Zope/lib/python/ZODB/FileStorage.py", line 687, in load
    return self._load(oid, version, self._index, self._file)
  File "/home/chrism/opt/tests/sandbox/Zope/lib/python/ZODB/FileStorage.py", line 658, in _load
    file.seek(pos)
ValueError: I/O operation on closed file

Exception in thread Thread-160:
Traceback (most recent call last):
  File "/home/chrism/opt/Python-2.2.3/lib/python2.2/threading.py", line 414, in __bootstrap
    self.run()
  File "/home/chrism/opt/tests/sandbox/Zope/lib/python/ZODB/tests/PackableStorage.py", line 516, in run
    self.root[j % 10].value = MinPO(j)
  File "/home/chrism/opt/Python-2.2.3/lib/python2.2/UserDict.py", line 14, in __getitem__
    def __getitem__(self, key): return self.data[key]
  File "/home/chrism/opt/tests/sandbox/Zope/lib/python/ZODB/Connection.py", line 561, in setstate
    p, serial = self._storage.load(oid, self._version)
  File "/home/chrism/opt/tests/sandbox/Zope/lib/python/ZODB/FileStorage.py", line 687, in load
    return self._load(oid, version, self._index, self._file)
  File "/home/chrism/opt/tests/sandbox/Zope/lib/python/ZODB/FileStorage.py", line 658, in _load
    file.seek(pos)
ValueError: I/O operation on closed file

Error in test testSetupLocale (Zope.Startup.tests.testStarter.ZopeStarterTestCase)
Traceback (most recent call last):
  File "/home/chrism/opt/tests/sandbox/Zope/lib/python/Zope/Startup/tests/testStarter.py", line 92, in testSetupLocale
    conf = self.load_config_text("""
  File "/home/chrism/opt/tests/sandbox/Zope/lib/python/Zope/Startup/tests/testStarter.py", line 78, in load_config_text
    conf, handler = ZConfig.loadConfigFile(schema, sio)
  File "/home/chrism/opt/tests/sandbox/Zope/lib/python/ZConfig/loader.py", line 46, in loadConfigFile
    return _get_config_loader(schema, overrides).loadFile(file, url)
  File "/home/chrism/opt/tests/sandbox/Zope/lib/python/ZConfig/loader.py", line 80, in loadFile
    return self.loadResource(r)
  File "/home/chrism/opt/tests/sandbox/Zope/lib/python/ZConfig/loader.py", line 184, in loadResource
    result = sm.finish(), CompositeHandler(sm.handlers, self.schema)
  File "/home/chrism/opt/tests/sandbox/Zope/lib/python/ZConfig/matcher.py", line 242, in finish
    v = BaseMatcher.finish(self)
  File "/home/chrism/opt/tests/sandbox/Zope/lib/python/ZConfig/matcher.py", line 170, in finish
    return self.constuct()
  File "/home/chrism/opt/tests/sandbox/Zope/lib/python/ZConfig/matcher.py", line 212, in constuct
    v = v.convert(ci.datatype)
  File "/home/chrism/opt/tests/sandbox/Zope/lib/python/ZConfig/info.py", line 67, in convert
    raise ZConfig.DataConversionError(e, self.value, self.position)
DataConversionError: The specified locale "fr_FR" is not supported by your system.
See your operating system documentation for more
information on locale support. (line 3)

======================================================================
ERROR: checkPackWhileWriting (ZODB.tests.testFileStorage.FileStorageTests)
----------------------------------------------------------------------
Traceback (most recent call last):
  File "/home/chrism/opt/tests/sandbox/Zope/lib/python/ZODB/tests/PackableStorage.py", line 433, in checkPackWhileWriting
    self._PackWhileWriting(pack_now=0)
  File "/home/chrism/opt/tests/sandbox/Zope/lib/python/ZODB/tests/PackableStorage.py", line 413, in _PackWhileWriting
    db.pack(packt)
  File "/home/chrism/opt/tests/sandbox/Zope/lib/python/ZODB/DB.py", line 528, in pack
    try: self._storage.pack(t,referencesf)
  File "/home/chrism/opt/tests/sandbox/Zope/lib/python/ZODB/FileStorage.py", line 1557, in pack
    opos = p.pack()
  File "/home/chrism/opt/tests/sandbox/Zope/lib/python/ZODB/fspack.py", line 678, in pack
    self.gc.findReachable()
  File "/home/chrism/opt/tests/sandbox/Zope/lib/python/ZODB/fspack.py", line 460, in findReachable
    self.findReachableFromFuture()
  File "/home/chrism/opt/tests/sandbox/Zope/lib/python/ZODB/fspack.py", line 535, in findReachableFromFuture
    self.checkTxn(th, pos)
  File "/home/chrism/opt/tests/sandbox/Zope/lib/python/ZODB/fspack.py", line 172, in checkTxn
    self.fail(pos, "transaction with checkpoint flag set")
  File "/home/chrism/opt/tests/sandbox/Zope/lib/python/ZODB/fspack.py", line 164, in fail
    raise CorruptedError(s)
CorruptedError: FileStorageTests.fs:30963:transaction with checkpoint flag set

======================================================================
ERROR: testSetupLocale (Zope.Startup.tests.testStarter.ZopeStarterTestCase)
----------------------------------------------------------------------
Traceback (most recent call last):
  File "/home/chrism/opt/tests/sandbox/Zope/lib/python/Zope/Startup/tests/testStarter.py", line 92, in testSetupLocale
    conf = self.load_config_text("""
  File "/home/chrism/opt/tests/sandbox/Zope/lib/python/Zope/Startup/tests/testStarter.py", line 78, in load_config_text
    conf, handler = ZConfig.loadConfigFile(schema, sio)
  File "/home/chrism/opt/tests/sandbox/Zope/lib/python/ZConfig/loader.py", line 46, in loadConfigFile
    return _get_config_loader(schema, overrides).loadFile(file, url)
  File "/home/chrism/opt/tests/sandbox/Zope/lib/python/ZConfig/loader.py", line 80, in loadFile
    return self.loadResource(r)
  File "/home/chrism/opt/tests/sandbox/Zope/lib/python/ZConfig/loader.py", line 184, in loadResource
    result = sm.finish(), CompositeHandler(sm.handlers, self.schema)
  File "/home/chrism/opt/tests/sandbox/Zope/lib/python/ZConfig/matcher.py", line 242, in finish
    v = BaseMatcher.finish(self)
  File "/home/chrism/opt/tests/sandbox/Zope/lib/python/ZConfig/matcher.py", line 170, in finish
    return self.constuct()
  File "/home/chrism/opt/tests/sandbox/Zope/lib/python/ZConfig/matcher.py", line 212, in constuct
    v = v.convert(ci.datatype)
  File "/home/chrism/opt/tests/sandbox/Zope/lib/python/ZConfig/info.py", line 67, in convert
    raise ZConfig.DataConversionError(e, self.value, self.position)
DataConversionError: The specified locale "fr_FR" is not supported by your system.
See your operating system documentation for more
information on locale support. (line 3)

======================================================================
FAIL: .../TAL/tests/input/test01.xml
----------------------------------------------------------------------
Traceback (most recent call last):
  File "/home/chrism/opt/tests/sandbox/Zope/lib/python/TAL/tests/test_files.py", line 41, in runTest
    self.fail("output for %s didn't match" % self.__file)
  File "/home/chrism/opt/Python-2.2.3/lib/python2.2/unittest.py", line 254, in fail
    raise self.failureException, msg
AssertionError: output for /home/chrism/opt/tests/sandbox/Zope/lib/python/TAL/tests/input/test01.xml didn't match

----------------------------------------------------------------------
Ran 2324 tests in 514.780s

FAILED (failures=1, errors=2)
Unhandled exception in thread:
Traceback (most recent call last):
  File "/home/chrism/opt/Python-2.2.3/lib/python2.2/threading.py", line 421, in __bootstrap
    s = _StringIO()
  File "/home/chrism/opt/Python-2.2.3/lib/python2.2/StringIO.py", line 53, in __init__
    if type(buf) not in types.StringTypes:
AttributeError: 'NoneType' object has no attribute 'StringTypes'




More information about the Zope-Coders mailing list