[Zope-Coders] Linux Test Results - 2_7-branch/Py2.2 - failures:1
errors:1
zope-tests at plope.com
zope-tests at plope.com
Mon Nov 17 05:36:27 EST 2003
======================================================================
Python Version:2.2.3 (#1, Aug 2 2003, 16:03:27)
[GCC 3.2 20020903 (Red Hat Linux 8.0 3.2-7)]
Modules included:
Zope (Zope-2_7-branch)
Running unit tests from /home/chrism/opt/tests/sandbox/Zope
/home/chrism/opt/tests/sandbox/Zope/lib/python/Products/PluginIndexes/DateRangeIndex/tests/test_DateRangeIndex.py:120: OverflowWarning: integer addition
bad = Dummy( 'bad', sys.maxint + 1, sys.maxint + 1 )
Traceback (most recent call last):
File "/home/chrism/opt/tests/sandbox/Zope/lib/python/TAL/runtest.py", line 92, in main
driver.main()
File "/home/chrism/opt/tests/sandbox/Zope/lib/python/TAL/driver.py", line 151, in main
it = compilefile(file, mode)
File "/home/chrism/opt/tests/sandbox/Zope/lib/python/TAL/driver.py", line 190, in compilefile
p.parseFile(file)
File "/home/chrism/opt/tests/sandbox/Zope/lib/python/TAL/XMLParser.py", line 77, in parseFile
self.parseStream(open(filename))
File "/home/chrism/opt/tests/sandbox/Zope/lib/python/TAL/XMLParser.py", line 87, in parseStream
self.parser.ParseFile(stream)
ExpatError: undefined entity: line 18, column 2
Failure in test runTest (TAL.tests.test_files.FileTestCase)
Traceback (most recent call last):
File "/home/chrism/opt/tests/sandbox/Zope/lib/python/TAL/tests/test_files.py", line 41, in runTest
self.fail("output for %s didn't match" % self.__file)
File "/home/chrism/opt/Python-2.2.3/lib/python2.2/unittest.py", line 254, in fail
raise self.failureException, msg
AssertionError: output for /home/chrism/opt/tests/sandbox/Zope/lib/python/TAL/tests/input/test01.xml didn't match
Error in test testSetupLocale (Zope.Startup.tests.testStarter.ZopeStarterTestCase)
Traceback (most recent call last):
File "/home/chrism/opt/tests/sandbox/Zope/lib/python/Zope/Startup/tests/testStarter.py", line 92, in testSetupLocale
conf = self.load_config_text("""
File "/home/chrism/opt/tests/sandbox/Zope/lib/python/Zope/Startup/tests/testStarter.py", line 78, in load_config_text
conf, handler = ZConfig.loadConfigFile(schema, sio)
File "/home/chrism/opt/tests/sandbox/Zope/lib/python/ZConfig/loader.py", line 46, in loadConfigFile
return _get_config_loader(schema, overrides).loadFile(file, url)
File "/home/chrism/opt/tests/sandbox/Zope/lib/python/ZConfig/loader.py", line 80, in loadFile
return self.loadResource(r)
File "/home/chrism/opt/tests/sandbox/Zope/lib/python/ZConfig/loader.py", line 184, in loadResource
result = sm.finish(), CompositeHandler(sm.handlers, self.schema)
File "/home/chrism/opt/tests/sandbox/Zope/lib/python/ZConfig/matcher.py", line 242, in finish
v = BaseMatcher.finish(self)
File "/home/chrism/opt/tests/sandbox/Zope/lib/python/ZConfig/matcher.py", line 170, in finish
return self.constuct()
File "/home/chrism/opt/tests/sandbox/Zope/lib/python/ZConfig/matcher.py", line 212, in constuct
v = v.convert(ci.datatype)
File "/home/chrism/opt/tests/sandbox/Zope/lib/python/ZConfig/info.py", line 67, in convert
raise ZConfig.DataConversionError(e, self.value, self.position)
DataConversionError: The specified locale "fr_FR" is not supported by your system.
See your operating system documentation for more
information on locale support. (line 3)
======================================================================
ERROR: testSetupLocale (Zope.Startup.tests.testStarter.ZopeStarterTestCase)
----------------------------------------------------------------------
Traceback (most recent call last):
File "/home/chrism/opt/tests/sandbox/Zope/lib/python/Zope/Startup/tests/testStarter.py", line 92, in testSetupLocale
conf = self.load_config_text("""
File "/home/chrism/opt/tests/sandbox/Zope/lib/python/Zope/Startup/tests/testStarter.py", line 78, in load_config_text
conf, handler = ZConfig.loadConfigFile(schema, sio)
File "/home/chrism/opt/tests/sandbox/Zope/lib/python/ZConfig/loader.py", line 46, in loadConfigFile
return _get_config_loader(schema, overrides).loadFile(file, url)
File "/home/chrism/opt/tests/sandbox/Zope/lib/python/ZConfig/loader.py", line 80, in loadFile
return self.loadResource(r)
File "/home/chrism/opt/tests/sandbox/Zope/lib/python/ZConfig/loader.py", line 184, in loadResource
result = sm.finish(), CompositeHandler(sm.handlers, self.schema)
File "/home/chrism/opt/tests/sandbox/Zope/lib/python/ZConfig/matcher.py", line 242, in finish
v = BaseMatcher.finish(self)
File "/home/chrism/opt/tests/sandbox/Zope/lib/python/ZConfig/matcher.py", line 170, in finish
return self.constuct()
File "/home/chrism/opt/tests/sandbox/Zope/lib/python/ZConfig/matcher.py", line 212, in constuct
v = v.convert(ci.datatype)
File "/home/chrism/opt/tests/sandbox/Zope/lib/python/ZConfig/info.py", line 67, in convert
raise ZConfig.DataConversionError(e, self.value, self.position)
DataConversionError: The specified locale "fr_FR" is not supported by your system.
See your operating system documentation for more
information on locale support. (line 3)
======================================================================
FAIL: .../TAL/tests/input/test01.xml
----------------------------------------------------------------------
Traceback (most recent call last):
File "/home/chrism/opt/tests/sandbox/Zope/lib/python/TAL/tests/test_files.py", line 41, in runTest
self.fail("output for %s didn't match" % self.__file)
File "/home/chrism/opt/Python-2.2.3/lib/python2.2/unittest.py", line 254, in fail
raise self.failureException, msg
AssertionError: output for /home/chrism/opt/tests/sandbox/Zope/lib/python/TAL/tests/input/test01.xml didn't match
----------------------------------------------------------------------
Ran 2324 tests in 514.811s
FAILED (failures=1, errors=1)
More information about the Zope-Coders
mailing list