[Zope-Coders] Linux Test Results - 2_6-branch/Py21 - failures:1
errors:1
zope-tests at plope.com
zope-tests at plope.com
Fri Nov 28 05:13:27 EST 2003
======================================================================
Python Version:2.1.3 (#1, Aug 2 2003, 16:00:38)
[GCC 3.2 20020903 (Red Hat Linux 8.0 3.2-7)]
Modules included:
Zope (Zope-2_6-branch)
Traceback (most recent call last):
File "/home/chrism/opt/tests/sandbox/Zope/lib/python/TAL/runtest.py", line 92, in main
driver.main()
File "/home/chrism/opt/tests/sandbox/Zope/lib/python/TAL/driver.py", line 150, in main
it = compilefile(file, mode)
File "/home/chrism/opt/tests/sandbox/Zope/lib/python/TAL/driver.py", line 189, in compilefile
p.parseFile(file)
File "/home/chrism/opt/tests/sandbox/Zope/lib/python/TAL/XMLParser.py", line 77, in parseFile
self.parseStream(open(filename))
File "/home/chrism/opt/tests/sandbox/Zope/lib/python/TAL/XMLParser.py", line 87, in parseStream
self.parser.ParseFile(stream)
ExpatError: undefined entity: line 18, column 2
======================================================================
ERROR: checkPackWhileWriting (testFileStorage.FileStorageTests)
----------------------------------------------------------------------
Traceback (most recent call last):
File "/home/chrism/opt/tests/sandbox/Zope/lib/python/ZODB/tests/PackableStorage.py", line 409, in checkPackWhileWriting
db.pack(packt)
File "/home/chrism/opt/tests/sandbox/Zope/lib/python/ZODB/DB.py", line 526, in pack
try: self._storage.pack(t,referencesf)
File "/home/chrism/opt/tests/sandbox/Zope/lib/python/ZODB/FileStorage.py", line 1503, in pack
opos = p.pack()
File "/home/chrism/opt/tests/sandbox/Zope/lib/python/ZODB/fspack.py", line 680, in pack
self.gc.findReachable()
File "/home/chrism/opt/tests/sandbox/Zope/lib/python/ZODB/fspack.py", line 466, in findReachable
self.findReachableFromFuture()
File "/home/chrism/opt/tests/sandbox/Zope/lib/python/ZODB/fspack.py", line 541, in findReachableFromFuture
self.checkTxn(th, pos)
File "/home/chrism/opt/tests/sandbox/Zope/lib/python/ZODB/fspack.py", line 178, in checkTxn
self.fail(pos, "transaction with checkpoint flag set")
File "/home/chrism/opt/tests/sandbox/Zope/lib/python/ZODB/fspack.py", line 170, in fail
raise CorruptedError(s)
CorruptedError: FileStorageTests.fs:31457:transaction with checkpoint flag set
======================================================================
FAIL: .../TAL/tests/input/test01.xml
----------------------------------------------------------------------
Traceback (most recent call last):
File "test_files.py", line 41, in runTest
File "/home/chrism/opt/Python-2.1.3/lib/python2.1/unittest.py", line 241, in fail
raise self.failureException, msg
AssertionError: output for /home/chrism/opt/tests/sandbox/Zope/lib/python/TAL/tests/input/test01.xml didn't match
----------------------------------------------------------------------
Ran 1920 tests in 324.260s
FAILED (failures=1, errors=1)
======================================================================
OVERALL FAILED (total failures=1, total errors=1)
More information about the Zope-Coders
mailing list