[Zope-Coders] Win32 Tests - Zope 2.6 branch - failures:1
zope-tests at squishdot.org
zope-tests at squishdot.org
Fri Oct 17 04:58:49 EDT 2003
======================================================================
Python Version:2.1.3 (#35, Apr 8 2002, 17:47:50) [MSC 32 bit (Intel)]
Modules included:
Zope (Zope-2_6-branch)
======================================================================
FAIL: checkReadOnlyFallbackReadOnlyServer (testConnection.WindowsConnectionTests)
----------------------------------------------------------------------
Traceback (most recent call last):
File "C:\ZopeTests\sandbox\Zope\lib\python\ZEO\tests\ConnectionTests.py", line 244, in checkReadOnlyFallbackReadOnlyServer
self.assert_(self._storage.isReadOnly())
File "C:\python21\lib\unittest.py", line 249, in failUnless
if not expr: raise self.failureException, msg
AssertionError
----------------------------------------------------------------------
Ran 1906 tests in 731.547s
FAILED (failures=1)
======================================================================
OVERALL FAILED (total failures=1)
More information about the Zope-Coders
mailing list