[Zope-Coders] Zope tests: 1 OK, 1 Failed, 3 Unknown

Zope tests summarizer zopetests at z3u.com
Sat Jan 31 07:01:06 EST 2004


Summary of messages to the zope-tests list.
Period Fri Jan 30 12:01:02 2004 UTC to Sat Jan 31 12:01:02 2004 UTC.
There were 5 messages: 5 from jeremy at zope.com.


Test failures
-------------

Subject: FAILED (failures=1): Test Zope 2.7 / Python 2.3 / Linux
From: jeremy at zope.com
Date: Fri Jan 30 07:32:22 EST 2004
URL: http://mail.zope.org/pipermail/zope-tests/2004-January/000358.html


Unknown
-------

Subject: error: (98,
	'Address already in use'): Test ZODB HEAD / Python 2.3 / Linux
From: jeremy at zope.com
Date: Fri Jan 30 15:29:20 EST 2004
URL: http://mail.zope.org/pipermail/zope-tests/2004-January/000361.html

Subject: error: (98,
	'Address already in use'): Test Zope 2.7 / Python 2.3 / Linux
From: jeremy at zope.com
Date: Fri Jan 30 15:29:20 EST 2004
URL: http://mail.zope.org/pipermail/zope-tests/2004-January/000359.html

Subject: error: (98,
	'Address already in use'): Test Zope 2 HEAD / Python 2.3 / Linux
From: jeremy at zope.com
Date: Fri Jan 30 15:29:20 EST 2004
URL: http://mail.zope.org/pipermail/zope-tests/2004-January/000360.html


Tests passed OK
---------------

Subject: OK: Test ZODB HEAD / Python 2.3 / Linux
From: jeremy at zope.com
Date: Sat Jan 31 06:22:20 EST 2004
URL: http://mail.zope.org/pipermail/zope-tests/2004-January/000362.html




More information about the Zope-Coders mailing list