[Zope-Coders] Zope tests: 2 OK, 4 Failed

Zope tests summarizer zopetests at z3u.com
Fri Jan 14 07:01:05 EST 2005


Summary of messages to the zope-tests list.
Period Thu Jan 13 12:01:01 2005 UTC to Fri Jan 14 12:01:01 2005 UTC.
There were 6 messages: 6 from Zope Unit Tests.


Test failures
-------------

Subject: FAILED (errors=1) : Zope-2_7-branch Python-2.3.4 :
	Linux
From: Zope Unit Tests
Date: Fri Jan 14 00:12:36 EST 2005
URL: http://mail.zope.org/pipermail/zope-tests/2005-January/001417.html

Subject: FAILED (errors=1) : Zope-2_7-branch Python-2.4 : Linux
From: Zope Unit Tests
Date: Fri Jan 14 00:15:06 EST 2005
URL: http://mail.zope.org/pipermail/zope-tests/2005-January/001418.html

Subject: FAILED (failures=1,
	errors=1) : Zope-trunk Python-2.3.4 : Linux
From: Zope Unit Tests
Date: Fri Jan 14 00:17:36 EST 2005
URL: http://mail.zope.org/pipermail/zope-tests/2005-January/001419.html

Subject: FAILED (failures=1,
	errors=1) : Zope-trunk Python-2.4 : Linux
From: Zope Unit Tests
Date: Fri Jan 14 00:20:06 EST 2005
URL: http://mail.zope.org/pipermail/zope-tests/2005-January/001420.html


Tests passed OK
---------------

Subject: OK : Zope-2_6-branch Python-2.1.3 : Linux
From: Zope Unit Tests
Date: Fri Jan 14 00:07:36 EST 2005
URL: http://mail.zope.org/pipermail/zope-tests/2005-January/001415.html

Subject: OK : Zope-2_6-branch Python-2.3.4 : Linux
From: Zope Unit Tests
Date: Fri Jan 14 00:10:06 EST 2005
URL: http://mail.zope.org/pipermail/zope-tests/2005-January/001416.html



More information about the Zope-Coders mailing list