[Zope-Coders] Zope tests: 5 OK, 1 Failed
Andreas Jung
lists at andreas-jung.com
Sun May 15 07:17:34 EDT 2005
Is this a serious ZEO problem?
Andreas
--On Sonntag, 15. Mai 2005 12:01 Uhr +0100 Zope tests summarizer
<zopetests at z3u.com> wrote:
> http://mail.zope.org/pipermail/zope-tests/2005-May/002125.html
? Messages sorted by: [ date ] [ thread ] [ subject ] [ author ]
Zope Unit Tests : FAILED (failures=1)
Zope-trunk Python-2.3.5 : Linux
Running /usr/local/python2.3/bin/python test.py
Script (Python):filepath:1: DeprecationWarning: integer argument expected,
got float
======================================================================
FAIL: checkCrossDBInvalidations
(ZEO.tests.testConnection.MappingStorageConnectionTests)
----------------------------------------------------------------------
Traceback (most recent call last):
File
"/autotest/temp/python23-zope28/lib/python/ZEO/tests/ConnectionTests.py",
line 658, in checkCrossDBInvalidations
self.assertEqual(r1._p_state, -1) # ghost
File "/usr/local/python2.3/lib/python2.3/unittest.py", line 302, in
failUnlessEqual
raise self.failureException, \
AssertionError: 0 != -1
----------------------------------------------------------------------
Ran 5691 tests in 583.749s
-------------- next part --------------
A non-text attachment was scrubbed...
Name: not available
Type: application/pgp-signature
Size: 186 bytes
Desc: not available
Url : http://mail.zope.org/pipermail/zope-coders/attachments/20050515/d8a27557/attachment.bin
More information about the Zope-Coders
mailing list