[Zope-Coders] Zope tests: 5 OK, 1 Failed
Andreas Jung
lists at andreas-jung.com
Sun May 15 13:32:48 EDT 2005
Trying to run the tests now...
--On Sonntag, 15. Mai 2005 19:20 Uhr +0200 "Stefan H. Holek"
<stefan at epy.co.at> wrote:
> This test passes with Python 2.4.1 on that (Linux) box and it passes
> fine with both 2.3.5 and 2.4.1 on Mac OS X.
>
> Also, when I run the ZEO tests alone: python2.3 test.py --dir lib/
> python/ZEO they pass as well.
>
> The box I use to run the nightly tests is rather sluggish, so it may
> just be an artefact of that (like other test failures have turned out to
> be).
>
> Do you have a Linux box you could confirm the failure on?
>
> Hunting-for-a-faster-box-ly,
>
> Stefan
>
>
> On 15. Mai 2005, at 13:17, Andreas Jung wrote:
>
>> Is this a serious ZEO problem?
>>
>> Andreas
>>
>> --On Sonntag, 15. Mai 2005 12:01 Uhr +0100 Zope tests summarizer
>> <zopetests at z3u.com> wrote:
>>
>>
>> Zope Unit Tests : FAILED (failures=1)
>> Zope-trunk Python-2.3.5 : Linux
>>
>> Running /usr/local/python2.3/bin/python test.py
>> Script (Python):filepath:1: DeprecationWarning: integer argument
>> expected, got float
>> ======================================================================
>> FAIL: checkCrossDBInvalidations
>> (ZEO.tests.testConnection.MappingStorageConnectionTests)
>> ----------------------------------------------------------------------
>> Traceback (most recent call last):
>> File "/autotest/temp/python23-zope28/lib/python/ZEO/tests/
>> ConnectionTests.py", line 658, in checkCrossDBInvalidations
>> self.assertEqual(r1._p_state, -1) # ghost
>> File "/usr/local/python2.3/lib/python2.3/unittest.py", line 302,
>> in failUnlessEqual
>> raise self.failureException, \
>> AssertionError: 0 != -1
>>
>> ----------------------------------------------------------------------
>> Ran 5691 tests in 583.749s
>>
>
> --
> Software Engineering is Programming when you can't. --E. W. Dijkstra
-------------- next part --------------
A non-text attachment was scrubbed...
Name: not available
Type: application/pgp-signature
Size: 186 bytes
Desc: not available
Url : http://mail.zope.org/pipermail/zope-coders/attachments/20050515/b2688de8/attachment.bin
More information about the Zope-Coders
mailing list