[Zope-tests] FAILED (failures=1) : Zope-2.7 Python-2.3.6 : Linux

Zope Unit Tests zope-tests at epy.co.at
Sat Oct 27 20:50:35 EDT 2007


Zope Unit Tests : FAILED (failures=1)
Zope-2.7 Python-2.3.6 : Linux

Running /usr/local/python2.3/bin/python test.py
/home/stefan/autotest/temp/python23-zope27/lib/python/BTrees/check.py:207: FutureWarning: %u/%o/%x/%X of negative int will return a signed string in Python 2.4 and up
  return "%s (0x%x)" % (type(obj).__name__, id(obj))
Script (Python):filepath:1: DeprecationWarning: integer argument expected, got float
/home/stefan/autotest/temp/python23-zope27/lib/python/ZODB/Connection.py:152: FutureWarning: %u/%o/%x/%X of negative int will return a signed string in Python 2.4 and up
  return '<Connection at %08x%s>' % (id(self), ver)
/home/stefan/autotest/temp/python23-zope27/lib/python/ZODB/tests/testTransaction.py:599: FutureWarning: %u/%o/%x/%X of negative int will return a signed string in Python 2.4 and up
  return "<jar %X %s>" % (id(self), self.errors)
======================================================================
FAIL: Reconstruction of a DateTime from its parts, with subtraction
----------------------------------------------------------------------
Traceback (most recent call last):
  File "/home/stefan/autotest/temp/python23-zope27/lib/python/DateTime/tests/testDateTime.py", line 138, in testSubtraction
    self.assertEqual(dt1, dt3, (dt, dt1, dt2, dt3))
  File "/usr/local/python2.3/lib/python2.3/unittest.py", line 302, in failUnlessEqual
    raise self.failureException, \
AssertionError: (DateTime('2007/10/28 02:01:43.159 GMT+2'), DateTime('2007/10/24 22:37:49.554 GMT+2'), DateTime('2007/10/28 02:01:43.159 GMT+1'), DateTime('2007/10/24 22:37:49.554 GMT+1'))

----------------------------------------------------------------------
Ran 2553 tests in 194.372s

FAILED (failures=1)


More information about the Zope-tests mailing list