<!DOCTYPE HTML PUBLIC "-//W3C//DTD HTML 4.0 Transitional//EN">
<HTML><HEAD>
<META http-equiv=Content-Type content="text/html; charset=iso-8859-1">
<META content="MSHTML 6.00.2800.1400" name=GENERATOR>
<STYLE></STYLE>
</HEAD>
<BODY bgColor=#ffffff>
<DIV><FONT face=Arial size=2>I checked out the latest Zope3 source at 21:30 CST 
and ran the unit tests. I'm tracking down the failures, but here are&nbsp;the 
results if anyone is interested:</FONT></DIV>
<DIV><FONT size=1><FONT face=Arial size=2></FONT></FONT>&nbsp;</DIV>
<DIV><FONT size=1><FONT face=Arial 
size=2>======================================================================<BR>FAIL: 
test_commandline_overrides 
(zodb.zeo.tests.test_options.TestZEOOptions)<BR>----------------------------------------------------------------------<BR>Traceback 
(most recent call last):<BR>&nbsp; File 
"D:\sf\Zope3\src\zodb\zeo\tests\test_options.py", line 90, in 
test_commandline_overrides<BR>&nbsp;&nbsp;&nbsp; 
self.assertEqual(options.address, ("", 6666))<BR>&nbsp; File 
"C:\PYTHON23\Lib\unittest.py", line 302, in 
failUnlessEqual<BR>&nbsp;&nbsp;&nbsp; raise self.failureException, 
\<BR>AssertionError: ('localhost', 6666) != ('', 6666)</FONT></FONT></DIV>
<DIV>&nbsp;</DIV>
<DIV><FONT size=1><FONT face=Arial 
size=2>======================================================================<BR>FAIL: 
test_defaults_with_schema 
(zodb.zeo.tests.test_options.TestZEOOptions)<BR>----------------------------------------------------------------------<BR>Traceback 
(most recent call last):<BR>&nbsp; File 
"D:\sf\Zope3\src\zodb\zeo\tests\test_options.py", line 64, in 
test_defaults_with_schema<BR>&nbsp;&nbsp;&nbsp; 
self.assertEqual(options.address, ("", 5555))<BR>&nbsp; File 
"C:\PYTHON23\Lib\unittest.py", line 302, in 
failUnlessEqual<BR>&nbsp;&nbsp;&nbsp; raise self.failureException, 
\<BR>AssertionError: ('localhost', 5555) != ('', 5555)</FONT></FONT></DIV>
<DIV>&nbsp;</DIV>
<DIV><FONT size=1><FONT face=Arial 
size=2>======================================================================<BR>FAIL: 
test_defaults_without_schema 
(zodb.zeo.tests.test_options.TestZEOOptions)<BR>----------------------------------------------------------------------<BR>Traceback 
(most recent call last):<BR>&nbsp; File 
"D:\sf\Zope3\src\zodb\zeo\tests\test_options.py", line 76, in 
test_defaults_without_schema<BR>&nbsp;&nbsp;&nbsp; 
self.assertEqual(options.address, ("", 5555))<BR>&nbsp; File 
"C:\PYTHON23\Lib\unittest.py", line 302, in 
failUnlessEqual<BR>&nbsp;&nbsp;&nbsp; raise self.failureException, 
\<BR>AssertionError: ('localhost', 5555) != ('', 5555)</FONT></FONT></DIV>
<DIV>&nbsp;</DIV>
<DIV><FONT size=1><FONT face=Arial 
size=2>======================================================================<BR>FAIL: 
Doctest: 
zope.products.pythonpage.PythonPage<BR>----------------------------------------------------------------------<BR>Traceback 
(most recent call last):<BR>&nbsp; File 
"D:\sf\Zope3\src\zope\testing\doctestunit.py", line 67, in 
runTest<BR>&nbsp;&nbsp;&nbsp; raise self.failureException(<BR>AssertionError: 
Failed doctest test for zope.products.pythonpage.PythonPage<BR>&nbsp; File 
"D:\sf\Zope3\src\zope\products\pythonpage\__init__.py", line 107 (or above), in 
PythonPage</FONT></FONT></DIV>
<DIV>&nbsp;</DIV>
<DIV><FONT size=1><FONT face=Arial 
size=2>*****************************************************************<BR>Failure 
in example:<BR>try:<BR>&nbsp;&nbsp;&nbsp; pp.setSource(u"prin 
'hello'")<BR>except SyntaxError, err:<BR>&nbsp;&nbsp;&nbsp; print err<BR>from 
line #38 of zope.products.pythonpage.PythonPage<BR>Expected: invalid syntax (pp, 
line 1)<BR>Got: invalid syntax (/pp, line 1)</FONT></FONT></DIV>
<DIV>&nbsp;</DIV><FONT size=1><FONT face=Arial size=2>
<DIV><BR>----------------------------------------------------------------------<BR>Ran 
5211 tests in 3799.353s</DIV>
<DIV>&nbsp;</DIV>
<DIV>FAILED (failures=4)<BR></FONT></DIV></FONT></BODY></HTML>