[Zope-Coders] Win32 Test Results failures:1
zope-tests@squishdot.org
zope-tests@squishdot.org
Tue, 04 Jun 2002 02:16:47 +0100
==============================================================================
==============================================================================
Python Version:2.1.3 (#35, Apr 8 2002, 17:47:50) [MSC 32 bit (Intel)]
Modules included:
Zope (HEAD)
CMF/CMFCore (HEAD)
CMF/CMFCalendar (HEAD)
CMF/CMFCollector (HEAD)
CMF/CMFDecor (HEAD)
CMF/CMFDefault (HEAD)
CMF/CMFTopic (HEAD)
CMF/CMFTracker (HEAD)
CMF/CMFWiki (HEAD)
CMF/DCWorkflow (HEAD)
======================================================================
FAIL: checkDetail (testCache.LRUCacheTests)
----------------------------------------------------------------------
Traceback (most recent call last):
File "testCache.py", line 201, in checkDetail
File "C:\Python21\lib\unittest.py", line 273, in failUnlessEqual
raise self.failureException, (msg or '%s != %s' % (first, second))
AssertionError: 4 != 3
----------------------------------------------------------------------
Ran 1716 tests in 262.938s
FAILED (failures=1)
======================================================================
OVERALL FAILED (total failures=1)
==============================================================================
==============================================================================
Python Version:2.1.3 (#35, Apr 8 2002, 17:47:50) [MSC 32 bit (Intel)]
Modules included:
Zope (Zope-2_5-branch)
----------------------------------------------------------------------
Ran 1159 tests in 196.042s
OK