[Zope-Coders] Win32 Tests - Zope 2.6 branch - failures:1
zope-tests@squishdot.org
zope-tests@squishdot.org
Mon, 20 Jan 2003 02:22:27 +0000
==============================================================================
==============================================================================
Python Version:2.1.3 (#35, Apr 8 2002, 17:47:50) [MSC 32 bit (Intel)]
Modules included:
Zope (Zope-2_6-branch)
======================================================================
FAIL: testMaxListUsers (testUserFolder.UserFolderTests)
----------------------------------------------------------------------
Traceback (most recent call last):
File "testUserFolder.py", line 57, in testMaxListUsers
AssertionError: Did not raise overflow error
----------------------------------------------------------------------
Ran 1715 tests in 169.141s
FAILED (failures=1)
======================================================================
OVERALL FAILED (total failures=1)