[Zope-Coders] Win32 Tests - Zope HEAD - failures:2
zope-tests@squishdot.org
zope-tests@squishdot.org
Tue, 21 Jan 2003 02:22:23 +0000
==============================================================================
==============================================================================
Python Version:2.2.2 (#37, Oct 14 2002, 17:02:34) [MSC 32 bit (Intel)]
Modules included:
Zope (HEAD)
======================================================================
FAIL: testMaxListUsers (testUserFolder.UserFolderTests)
----------------------------------------------------------------------
Traceback (most recent call last):
File "testUserFolder.py", line 57, in testMaxListUsers
AssertionError: Did not raise overflow error
======================================================================
FAIL: checkNoVerificationOnServerRestartWith2Clients (testConnection.FileStorageReconnectionTests)
----------------------------------------------------------------------
Traceback (most recent call last):
File "D:\ZopeTests\sandbox\Zope\lib\python\ZEO\tests\ConnectionTests.py", line 655, in checkNoVerificationOnServerRestartWith2Clients
self.assertEqual(perstorage.verify_result, "no verification")
File "c:\python22\lib\unittest.py", line 286, in failUnlessEqual
raise self.failureException, \
AssertionError: None != 'no verification'
----------------------------------------------------------------------
Ran 2078 tests in 783.375s
FAILED (failures=2)
======================================================================
OVERALL FAILED (total failures=2)